{"text_format":"1","workbook":"xlsx","n_sheets":5,"sheets":["CADASTRO- FORNEC - CLIENTE","RECIBO","C.INTERNA","ENVELOPE ( )","ENVELOPE"],"not_rendered":{"charts":0,"images":0,"macros":1,"external_links":0,"defined_names":4,"comments":0,"pivot_tables":0},"unopened":[],"bounds":{"document_bytes":16777216,"sheet_cells":100000,"rows_first":2000,"rows_last":500,"rows_between":2000,"halvings":0,"cell_chars":16384,"cell_head_chars":4096},"cells_cut":0,"cells_raw":0,"read":"whole","date_system":"1900"}

{"sheet":"CADASTRO- FORNEC - CLIENTE","index":0,"n_rows":1243,"n_cols":21,"rows_kept":1243,"cut":false,"hidden":false,"merged":[]}
[]
["N°","NOME (CLIENTE/FORNECEDOR)","ENDEREÇO",null,"COMPLEMENTO","BAIRRO","CIDADE","ESTADO","CEP","TELEFONE/FAX","CPF OU CNPJ","RG OU INSCRIÇÃO ESTADUAL","INSC. MUNICIPAL","DESCONTA ISS","BANCO PARA DEPÓSITO","CÓDIGO DO BANCO","CÓDIGO DA AGÊNCIA","CONTA CORRENTE","CAIXA POSTAL"]
[1," "," ",null," "," "," "," "," "," "," "," "," ",null," "," "," "," "," "," "]
[2,"TILDA & CIA LTDA. - ME","AVENIDA BRASIL",10,"SALA 2","VILA SÃO JORGE","PRESIDENTE PRUDENTE","SÃO PAULO","19.013-000","018 3223-0102","02.494.287/0001-89","11.444.559-8",65896,"DESCONTAR"," "," "," "," "," "]
[3,"LUIZ CARLOS DOS SANTOS","Rua Pacaembu",45,"apto 10","Estádio","Cambé","Parná","18.800-000","043 3390-1515","95.889.889-97","15.555.456-9"," "," "," "," "," "," "," "]
[4," "," "," "," "," "," "," "," "," "," "," "," "," "," "," "," "," "," "]
[5," "," "," "," "," "," "," "," "," "," "," "," ",null," "," "," "," "," "]
[6,null," "," "," "," "," "," "," "," "," "," "," ",null," "," "," "," "," "]
[7,null," "," "," "," "," "," "," "," "," "," "," ",null," "," "," "," "," "," "," "]
[8," "," "," "," "," "," "," "," "," "," "," "," "," "," "," "," "," "," "," "]
[9," "," "," "," "," "," "," "," "," "," "," "," "," "," "," "," "," "," "," "]
[10," "," "," "," "," "," "," "," "," "," "," "," "," "," "," "," "," "," "," "]
[11," "," "," "," "," "," "," "," "," "," "," "," "," "," "," "," "," "," "," "]
[12," "," "," "," "," "," "," "," "," "," "," "," "," "," "," "," "," "," "," "]
[13," "," "," "," "," "," "," "," "," "," "," "," "," "," "," "," "," "," "," "]
[14," "," "," "," "," "," "," "," "," "," "," "," "," "," "," "," "," "," "," "]
[15," "," "," "," "," "," "," "," "," "," "," "," "," "," "," "," "," "," "," "]
[16," "," "," "," "," "," "," "," "," "," "," "," "," "," "," "," "," "," "," "]
[17," "," "," "," "," "," "," "," "," "," "," "," "," "," "," "," "," "," "," "]
[18," "," "," "," "," "," "," "," "," "," "," "," "," "," "," "," "," "," "," "]
[19," "," "," "," "," "," "," "," "," "," "," "," "," "," "," "," "," "," "," "]
[20," "," "," "," "," "," "," "," "," "," "," "," "," "," "," "," "," "," "," "]
[21," "," "," "," "," "," "," "," "," "," "," "," "," "," "," "," "," "," "," "]
[22," "," "," "," "," "," "," "," "," "," "," "," "," "," "," "," "," "," "," "]
[23," "," "," "," "," "," "," "," "," "," "," "," "," "," "," "," "," "," "," "]
[24," "," "," "," "," "," "," "," "," "," "," "," "," "," "," "," "," "," "," "]
[25," "," "," "," "," "," "," "," "," "," "," "," "," "," "," "," "," "," "," "]
[26," "," "," "," "," "," "," "," "," "," "," "," "," "," "," "," "," "," "," "]
[27," "," "," "," "," "," "," "," "," "," "," "," "," "," "," "," "," "," "," "]
[28," "," "," "," "," "," "," "," "," "," "," "," "," "," "," "," "," "," "," "]
[29," "," "," "," "," "," "," "," "," "," "," "," "," "," "," "," "," "," "," "]
[30," "," "," "," "," "," "," "," "," "," "," "," "," "," "," "," "," "," "," "]
[31," "," "," "," "," "," "," "," "," "," "," "," "," "," "," "," "," "," "," "]
[32," "," "," "," "," "," "," "," "," "," "," "," "," "," "," "," "," "," "," "]
[33," "," "," "," "," "," "," "," "," "," "," "," "," "," "," "," "," "," "," "]
[34," "," "," "," "," "," "," "," "," "," "," "," "," "," "," "," "," "," "," "]
[35," "," "," "," "," "," "," "," "," "," "," "," "," "," "," "," "," "," "," "]
[36," "," "," "," "," "," "," "," "," "," "," "," "," "," "," "," "," "," "," "]
[37," "," "," "," "," "," "," "," "," "," "," "," "," "," "," "," "," "," "," "]
[38," "," "," "," "," "," "," "," "," "," "," "," "," "," "," "," "," "," "," "]
[39," "," "," "," "," "," "," "," "," "," "," "," "," "," "," "," "," "," "," "]
[40," "," "," "," "," "," "," "," "," "," "," "," "," "," "," "," "," "," "," "]
[41," "," "," "," "," "," "," "," "," "," "," "," "," "," "," "," "," "," "," "]
[42," "," "," "," "," "," "," "," "," "," "," "," "," "," "," "," "," "," "," "]
[43," "," "," "," "," "," "," "," "," "," "," "," "," "," "," "," "," "," "," "]
[44," "," "," "," "," "," "," "," "," "," "," "," "," "," "," "," "," "," "," "]
[45," "," "," "," "," "," "," "," "," "," "," "," "," "," "," "," "," "," "," "]
[46," "," "," "," "," "," "," "," "," "," "," "," "," "," "," "," "," "," "," "]
[47," "," "," "," "," "," "," "," "," "," "," "," "," "," "," "," "," "," "," "]
[48," "," "," "," "," "," "," "," "," "," "," "," "," "," "," "," "," "," "," "]
[49," "," "," "," "," "," "," "," "," "," "," "," "," "," "," "," "," "," "," "]
[50," "," "," "," "," "," "," "," "," "," "," "," "," "," "," "," "," "," "," "]
[51," "," "," "," "," "," "," "," "," "," "," "," "," "," "," "," "," "," "," "]
[52," "," "," "," "," "," "," "," "," "," "," "," "," "," "," "," "," "," "," "]
[53," "," "," "," "," "," "," "," "," "," "," "," "," "," "," "," "," "," "," "]
[54," "," "," "," "," "," "," "," "," "," "," "," "," "," "," "," "," "," "," "]
[55," "," "," "," "," "," "," "," "," "," "," "," "," "," "," "," "," "," "," "]
[56," "," "," "," "," "," "," "," "," "," "," "," "," "," "," "," "," "," "," "]
[57," "," "," "," "," "," "," "," "," "," "," "," "," "," "," "," "," "," "," "]
[58," "," "," "," "," "," "," "," "," "," "," "," "," "," "," "," "," "," "," "]
[59," "," "," "," "," "," "," "," "," "," "," "," "," "," "," "," "," "," "," "]
[60," "," "," "," "," "," "," "," "," "," "," "," "," "," "," "," "," "," "," "]
[61," "," "," "," "," "," "," "," "," "," "," "," "," "," "," "," "," "," "," "]
[62," "," "," "," "," "," "," "," "," "," "," "," "," "," "," "," "," "," "," "]
[63," "," "," "," "," "," "," "," "," "," "," "," "," "," "," "," "," "," "," "]
[64," "," "," "," "," "," "," "," "," "," "," "," "," "," "," "," "," "," "," "]
[65," "," "," "," "," "," "," "," "," "," "," "," "," "," "," "," "," "," "," "]
[66," "," "," "," "," "," "," "," "," "," "," "," "," "," "," "," "," "," "," "]
[67," "," "," "," "," "," "," "," "," "," "," "," "," "," "," "," "," "," "," "]
[68," "," "," "," "," "," "," "," "," "," "," "," "," "," "," "," "," "," "," "]
[69," "," "," "," "," "," "," "," "," "," "," "," "," "," "," "," "," "," "," "]
[70," "," "," "," "," "," "," "," "," "," "," "," "," "," "," "," "," "," "," "]
[71," "," "," "," "," "," "," "," "," "," "," "," "," "," "," "," "," "," "," "]
[72," "," "," "," "," "," "," "," "," "," "," "," "," "," "," "," "," "," "," "]
[73," "," "," "," "," "," "," "," "," "," "," "," "," "," "," "," "," "," "," "]
[74," "," "," "," "," "," "," "," "," "," "," "," "," "," "," "," "," "," "," "]
[75," "," "," "," "," "," "," "," "," "," "," "," "," "," "," "," "," "," "," "]
[76," "," "," "," "," "," "," "," "," "," "," "," "," "," "," "," "," "," "," "]
[77," "," "," "," "," "," "," "," "," "," "," "," "," "," "," "," "," "," "," "]
[78," "," "," "," "," "," "," "," "," "," "," "," "," "," "," "," "," "," "," "]
[79," "," "," "," "," "," "," "," "," "," "," "," "," "," "," "," "," "," "," "]
[80," "," "," "," "," "," "," "," "," "," "," "," "," "," "," "," "," "," "," "]
[81," "," "," "," "," "," "," "," "," "," "," "," "," "," "," "," "," "," "," "]
[82," "," "," "," "," "," "," "," "," "," "," "," "," "," "," "," "," "," "," "]
[83," "," "," "," "," "," "," "," "," "," "," "," "," "," "," "," "," "," "," "]
[84," "," "," "," "," "," "," "," "," "," "," "," "," "," "," "," "," "," "," "]
[85," "," "," "," "," "," "," "," "," "," "," "," "," "," "," "," "," "," "," "]
[86," "," "," "," "," "," "," "," "," "," "," "," "," "," "," "," "," "," "," "]
[87," "," "," "," "," "," "," "," "," "," "," "," "," "," "," "," "," "," "," "]
[88," "," "," "," "," "," "," "," "," "," "," "," "," "," "," "," "," "," "," "]
[89," "," "," "," "," "," "," "," "," "," "," "," "," "," "," "," "," "," "," "]
[90," "," "," "," "," "," "," "," "," "," "," "," "," "," "," "," "," "," "," "]
[91," "," "," "," "," "," "," "," "," "," "," "," "," "," "," "," "," "," "," "]
[92," "," "," "," "," "," "," "," "," "," "," "," "," "," "," "," "," "," "," "]
[93," "," "," "," "," "," "," "," "," "," "," "," "," "," "," "," "," "," "," "]
[94," "," "," "," "," "," "," "," "," "," "," "," "," "," "," "," "," "," "," "]
[95," "," "," "," "," "," "," "," "," "," "," "," "," "," "," "," "," "," "," "]
[96," "," "," "," "," "," "," "," "," "," "," "," "," "," "," "," "," "," "," "]
[97," "," "," "," "," "," "," "," "," "," "," "," "," "," "," "," "," "," "," "]
[98," "," "," "," "," "," "," "," "," "," "," "," "," "," "," "," "," "," "," "]
[99," "," "," "," "," "," "," "," "," "," "," "," "," "," "," "," "," "," "," "]
[100," "," "," "," "," "," "," "," "," "," "," "," "," "," "," "," "," "," "," "]
[101," "," "," "," "," "," "," "," "," "," "," "," "," "," "," "," "," "," "," "]
[102," "," "," "," "," "," "," "," "," "," "," "," "," "," "," "," "," "," "," "]
[103," "," "," "," "," "," "," "," "," "," "," "," "," "," "," "," "," "," "," "]
[104," "," "," "," "," "," "," "," "," "," "," "," "," "," "," "," "," "," "," "]
[105," "," "," "," "," "," "," "," "," "," "," "," "," "," "," "," "," "," "," "]
[106," "," "," "," "," "," "," "," "," "," "," "," "," "," "," "," "," "," "," "]
[107," "," "," "," "," "," "," "," "," "," "," "," "," "," "," "," "," "," "," "]
[108," "," "," "," "," "," "," "," "," "," "," "," "," "," "," "," "," "," "," "]
[109," "," "," "," "," "," "," "," "," "," "," "," "," "," "," "," "," "," "," "]
[110," "," "," "," "," "," "," "," "," "," "," "," "," "," "," "," "," "," "," "]
[111," "," "," "," "," "," "," "," "," "," "," "," "," "," "," "," "," "," "," "]
[112," "," "," "," "," "," "," "," "," "," "," "," "," "," "," "," "," "," "," "]
[113," "," "," "," "," "," "," "," "," "," "," "," "," "," "," "," "," "," "," "]
[114," "," "," "," "," "," "," "," "," "," "," "," "," "," "," "," "," "," "," "]
[115," "," "," "," "," "," "," "," "," "," "," "," "," "," "," "," "," "," "," "]
[116," "," "," "," "," "," "," "," "," "," "," "," "," "," "," "," "," "," "," "]
[117," "," "," "," "," "," "," "," "," "," "," "," "," "," "," "," "," "," "," "]
[118," "," "," "," "," "," "," "," "," "," "," "," "," "," "," "," "," "," "," "]
{"$rows_left_out":1124}
{"sheet":"RECIBO","index":1,"n_rows":55,"n_cols":15,"rows_kept":55,"cut":false,"hidden":false,"merged":[[4,8,4,11],[6,2,6,4],[11,8,11,10],[7,2,7,4],[8,2,8,4],[9,2,9,4],[10,2,10,4],[30,2,30,11],[27,2,27,11],[1,10,2,10],[1,2,2,9],[6,8,6,9],[7,8,7,9],[8,8,8,9],[9,8,9,9],[1,11,2,11],[4,2,4,6],[23,4,23,6],[19,4,19,8],[19,10,19,11],[15,6,15,11],[23,9,23,11],[33,2,35,11],[21,9,21,11],[25,9,25,11],[31,4,31,11],[29,2,29,11],[52,8,52,11],[41,4,41,11],[45,4,45,6],[47,4,47,6],[51,2,51,4],[49,4,49,6],[49,9,49,11],[43,10,43,11],[45,9,45,11],[47,9,47,11],[51,6,51,7],[11,2,11,5],[10,8,10,9],[38,2,38,11],[39,6,39,11],[32,2,32,11],[17,6,17,11],[25,4,25,6],[28,2,28,11],[21,4,21,6]]}
[]
[" ",null,"RECIBO",null,null,null,null,null,null,null,"Nº","002"]
[" "]
[]
[" ",null,"GANHOS",null,null,null,null,null,"DESCONTOS"]
[]
[null,null,"mensalidade",null,null,"R$",250,null,"INSS",null,"R$",100]
[null,null,null,null,null,"R$",null,null,"IRRF",null,"R$"]
[null,null,null,null,null,"R$"," ",null,null,null,"R$"," "]
[null,null,null,null,null,"R$"," ",null,null,null,"R$"," "]
[null,null,null,null,null,"R$"," ",null,"TOTAL DESCONTO",null,"R$",{"$f":"SUM(L7:L10)","v":100}]
[null,null,"TOTAL BRUTO",null,null,null,{"$f":"SUM(G7:G11)","v":250},null,"LIQUIDO",null,null,{"$f":"G12-L11","v":150}]
[]
[]
[]
[null,null,null,null,null,null,"          DADOS DO CADASTRO",null,null,null,null,null,null,null,2]
[]
[null,null,"RECEBI (EMOS) DE",null,null,null,{"$f":"VLOOKUP($O$16,'CADASTRO- FORNEC - CLIENTE'!$A$3:$O$1360,2)","v":"TILDA & CIA LTDA. - ME"}]
[]
[null,null,"ENDEREÇO ",null,{"$f":"VLOOKUP($O$16,'CADASTRO- FORNEC - CLIENTE'!$A$3:$O$1360,3)","v":"AVENIDA BRASIL"},null,null,null,null,{"$f":"VLOOKUP($O$16,'CADASTRO- FORNEC - CLIENTE'!$A$3:$O$1360,4)","v":10},{"$f":"VLOOKUP($O$16,'CADASTRO- FORNEC - CLIENTE'!$A$3:$O$1360,5)","v":"SALA 2"}]
[]
[null,null,"BAIRRO",null,{"$f":"VLOOKUP($O$16,'CADASTRO- FORNEC - CLIENTE'!$A$3:$O$1360,6)","v":"VILA SÃO JORGE"},null,null,null,"CIDADE",{"$f":"VLOOKUP($O$16,'CADASTRO- FORNEC - CLIENTE'!$A$3:$O$1360,7)","v":"PRESIDENTE PRUDENTE"}]
[]
[null,null,"CEP",null,{"$f":"VLOOKUP($O$16,'CADASTRO- FORNEC - CLIENTE'!$A$3:$O$1360,9)","v":"19.013-000"},null,null,null,"FONE",{"$f":"VLOOKUP($O$16,'CADASTRO- FORNEC - CLIENTE'!$A$3:$O$1360,10)","v":"018 3223-0102"}]
[]
[null,null,"CPF/CNPJ N°",null,{"$f":"VLOOKUP($O$16,'CADASTRO- FORNEC - CLIENTE'!$A$3:$O$1360,11)","v":"02.494.287/0001-89"},null,null,null,"RG/ I.EST. N°",{"$f":"VLOOKUP($O$16,'CADASTRO- FORNEC - CLIENTE'!$A$3:$O$1360,12)","v":"11.444.559-8"}]
[]
[null,null,"A IMPORTÂNCIA DE      "]
[]
[]
[null,null,"\n"]
[]
[null,null,"REFERENTE A"]
[null,null,"Pagamento de mensalidade da formatura parcela 01/2012",null,null,null,null,null,null,null,null,null,0]
[]
[]
[]
[]
[]
[null,null,null,null,null,null,"           DADOS DO CADASTRO ",null,null,null,null,null,null,null,3]
[]
[null,null,"EMITENTE",null,{"$f":"VLOOKUP(O$40,'CADASTRO- FORNEC - CLIENTE'!$A$3:$S$4500,2)","v":"LUIZ CARLOS DOS SANTOS"}]
[]
[null,null,"ENDEREÇO ",null,{"$f":"VLOOKUP($O$40,'CADASTRO- FORNEC - CLIENTE'!$A$3:$O$1360,3)","v":"Rua Pacaembu"},null,null,null,null,{"$f":"VLOOKUP($O$40,'CADASTRO- FORNEC - CLIENTE'!$A$3:$O$1360,4)","v":45},{"$f":"VLOOKUP($O$40,'CADASTRO- FORNEC - CLIENTE'!$A$3:$O$1360,5)","v":"apto 10"}]
[]
[null,null,"BAIRRO",null,{"$f":"VLOOKUP($O$40,'CADASTRO- FORNEC - CLIENTE'!$A$3:$S$4500,6)","v":"Estádio"},null,null,null,"CIDADE",{"$f":"VLOOKUP($O$40,'CADASTRO- FORNEC - CLIENTE'!$A$3:$S$4500,7)","v":"Cambé"}]
[]
[null,null,"CEP",null,{"$f":"VLOOKUP($O$40,'CADASTRO- FORNEC - CLIENTE'!$A$3:$S$4500,9)","v":"18.800-000"},null,null,null,"FONE",{"$f":"VLOOKUP($O$40,'CADASTRO- FORNEC - CLIENTE'!$A$3:$S$4500,10)","v":"043 3390-1515"}]
[]
[null,null,"CNPJ",null,{"$f":"VLOOKUP($O$40,'CADASTRO- FORNEC - CLIENTE'!$A$3:$S$4500,11)","v":"95.889.889-97"},null,null,null,"I.ESTADUAL",{"$f":"VLOOKUP($O$40,'CADASTRO- FORNEC - CLIENTE'!$A$3:$S$4500,12)","v":"15.555.456-9"}]
[]
[null,null,{"$f":"J46","v":"Cambé"},null,null,null,"2014-03-18"]
[null,null,null,null,null,null,null,null,{"$f":"E42","v":"LUIZ CARLOS DOS SANTOS"}]
[null,null,"RECIBO V1 - MOD I -  (28-05-2014) (angelo.tonon@ig.com.br)"]
[null,"OBS:-"]

{"sheet":"C.INTERNA","index":2,"n_rows":48,"n_cols":7,"rows_kept":48,"cut":false,"hidden":true,"merged":[[46,5,46,8],[35,3,35,8],[37,3,37,8],[39,3,39,4],[41,3,41,4],[43,3,43,4],[43,6,43,8],[45,2,45,3],[33,4,33,8],[39,6,39,8],[41,6,41,8],[23,2,25,8],[18,2,20,8],[22,2,22,8],[32,2,32,8],[21,3,21,8],[27,2,27,3],[28,5,28,8],[1,2,2,8],[5,4,5,8],[11,3,11,4],[13,3,13,4],[7,4,7,8],[17,2,17,8],[15,3,15,4],[11,6,11,8],[13,6,13,8],[15,6,15,8]]}
[]
[" ",null,"COMUNICAÇÃO INTERNA"]
[" "]
[]
[]
[null,null,null,13]
[]
[null,null,"DE:-",null,{"$f":"VLOOKUP($D$6,'CADASTRO- FORNEC - CLIENTE'!A4:O1360,2)","v":" "}]
[]
[null,null,"ENDEREÇO ",{"$f":"VLOOKUP($D$6,'CADASTRO- FORNEC - CLIENTE'!$A$4:$O$1360,3)","v":" "}]
[]
[null,null,"BAIRRO",{"$f":"VLOOKUP($D$6,'CADASTRO- FORNEC - CLIENTE'!$A$4:$O$1360,5)","v":" "},null,"CIDADE",{"$f":"VLOOKUP($D$6,'CADASTRO- FORNEC - CLIENTE'!$A$4:$O$1360,6)","v":" "}]
[]
[null,null,"CEP",{"$f":"VLOOKUP($D$6,'CADASTRO- FORNEC - CLIENTE'!$A$4:$O$1360,8)","v":" "},null,"FONE",{"$f":"VLOOKUP($D$6,'CADASTRO- FORNEC - CLIENTE'!$A$4:$O$1360,9)","v":" "}]
[]
[null,null,"CPF/CNPJ N°",{"$f":"VLOOKUP($D$6,'CADASTRO- FORNEC - CLIENTE'!$A$4:$O$1360,10)","v":" "},null,"RG/ I.EST. N°",{"$f":"VLOOKUP($D$6,'CADASTRO- FORNEC - CLIENTE'!$A$4:$O$1360,11)","v":" "}]
[]
[null,null,"RECEBIMENTO DE DOCUMENTO (S):-"]
[null,null,"Declaração de atendimentos de 01/07/2005 do Hospital Universitário de Pres.Prudente - Médico Dr. Waldir Rodrigues da Silva"]
[]
[]
[]
[null,null,"ACEITAÇÃO OU RECUSA DO RECEBIMENTO (S) - (MOTIVO)"]
[null,null,"Recusa:- Esta declaração de atendimento não vale como atestado médico. Para que a empresa aceite, você deverá apresentar Atestado Médico com o código identificado da doença (CID) e o referido atestado médico não poderá conter rasuras."]
[]
[]
[]
[null,null,"PRESIDENTE PRUDENTE",null,"2005-07-02"]
[null,null,null,null,null,{"$f":"E8","v":" "}]
[]
[]
[]
[]
[null,null,null,33]
[]
[null,null,"PARA:-",{"$f":"VLOOKUP($D$34,'CADASTRO- FORNEC - CLIENTE'!$A$4:$AE$1691,2)","v":" "}]
[]
[null,null,"ENDEREÇO ",{"$f":"VLOOKUP($D$34,'CADASTRO- FORNEC - CLIENTE'!$A$4:$AE$1691,3)","v":" "}]
[]
[null,null,"BAIRRO",{"$f":"VLOOKUP($D$34,'CADASTRO- FORNEC - CLIENTE'!$A$4:$AE$1691,5)","v":" "},null,"CIDADE",{"$f":"VLOOKUP($D$34,'CADASTRO- FORNEC - CLIENTE'!$A$4:$AE$1691,6)","v":" "}]
[]
[null,null,"CEP",{"$f":"VLOOKUP($D$34,'CADASTRO- FORNEC - CLIENTE'!$A$4:$AE$1691,8)","v":" "},null,"FONE",{"$f":"VLOOKUP($D$34,'CADASTRO- FORNEC - CLIENTE'!$A$4:$AE$1691,9)","v":" "}]
[]
[null,null,"CPF",{"$f":"VLOOKUP($D$34,'CADASTRO- FORNEC - CLIENTE'!$A$4:$AE$1691,10)","v":" "},null,"RG",{"$f":"VLOOKUP($D$34,'CADASTRO- FORNEC - CLIENTE'!$A$4:$AE$1691,11)","v":" "}]
[]
[null,null,"PRESIDENTE PRUDENTE",null,"2005-07-02"]
[null,null,null,null,null,{"$f":"D36","v":" "}]
[null,null,"recibo v1 (angelotonon@bol.com.br)"]

{"sheet":"ENVELOPE ( )","index":3,"n_rows":45,"n_cols":8,"rows_kept":45,"cut":false,"hidden":true,"merged":[[39,7,44,7],[39,6,44,6],[25,3,29,3],[30,5,34,5],[25,2,44,2],[26,4,44,4],[30,3,44,3],[36,5,44,5]]}
[]
[]
[]
[]
[]
[]
[]
[]
[]
[]
[]
[]
[]
[]
[]
[]
[]
[]
[]
[]
[{"$f":"ENVELOPE!A5","v":2}]
[]
[]
[]
[]
[null,null,{"$f":"VLOOKUP($A$21,'CADASTRO- FORNEC - CLIENTE'!$A$2:AR1464,2)","v":"TILDA & CIA LTDA. - ME"},{"$f":"VLOOKUP($A$21,'CADASTRO- FORNEC - CLIENTE'!$A$2:AR1500,5)","v":"SALA 2"}]
[null,null,null,null,{"$f":"VLOOKUP($A$21,'CADASTRO- FORNEC - CLIENTE'!$A$2:AR1465,4)","v":10}]
[]
[]
[]
[null,null,null,{"$f":"VLOOKUP($A$21,'CADASTRO- FORNEC - CLIENTE'!$A$2:AR1498,3)","v":"AVENIDA BRASIL"},null,{"$f":"VLOOKUP($A$21,'CADASTRO- FORNEC - CLIENTE'!$A$2:AT1509,7)","v":"PRESIDENTE PRUDENTE"}]
[]
[]
[]
[]
[null,null,null,null,null,"-"]
[null,null,null,null,null,{"$f":"VLOOKUP($A$21,'CADASTRO- FORNEC - CLIENTE'!$A$2:AR1466,6)","v":"VILA SÃO JORGE"}]
[]
[]
[null,null,null,null,null,null,{"$f":"VLOOKUP($A$21,'CADASTRO- FORNEC - CLIENTE'!$A$2:AR1467,8)","v":"SÃO PAULO"},{"$f":"VLOOKUP($A$21,'CADASTRO- FORNEC - CLIENTE'!$A$2:AS1467,18)","v":" "}]
[]
[]
[]
[]
[null,"A"]

{"sheet":"ENVELOPE","index":4,"n_rows":10,"n_cols":2,"rows_kept":10,"cut":false,"hidden":true,"merged":[[6,1,6,4],[8,1,8,3]]}
[]
[]
[]
[]
[{"$f":"RECIBO!O16","v":2},"A"]
[null,{"$f":"VLOOKUP($A$5,'CADASTRO- FORNEC - CLIENTE'!$A$2:AR1464,2)","v":"TILDA & CIA LTDA. - ME"}]
[null,{"$f":"VLOOKUP($A$5,'CADASTRO- FORNEC - CLIENTE'!$A$2:AR1464,3)","v":"AVENIDA BRASIL"}]
[null,{"$f":"VLOOKUP($A$5,'CADASTRO- FORNEC - CLIENTE'!$A$2:AR1465,4)","v":10}]
[null,{"$f":"VLOOKUP($A$5,'CADASTRO- FORNEC - CLIENTE'!$A$2:AR1466,6)","v":"VILA SÃO JORGE"}]
[null,{"$f":"VLOOKUP($A$5,'CADASTRO- FORNEC - CLIENTE'!$A$2:AR1467,8)","v":"SÃO PAULO"}]