{"text_format":"1","workbook":"xlsx","n_sheets":5,"sheets":["CADASTRO- FORNEC - CLIENTE","RECIBO","C.INTERNA","ENVELOPE ( )","ENVELOPE"],"not_rendered":{"charts":0,"images":0,"macros":1,"external_links":0,"defined_names":4,"comments":0,"pivot_tables":0},"unopened":[],"bounds":{"document_bytes":16777216,"sheet_cells":100000,"rows_first":2000,"rows_last":500,"rows_between":2000,"halvings":0,"cell_chars":16384,"cell_head_chars":4096},"cells_cut":0,"cells_raw":0,"read":"whole","date_system":"1900"}

{"sheet":"CADASTRO- FORNEC - CLIENTE","index":0,"n_rows":1243,"n_cols":21,"rows_kept":1243,"cut":false,"hidden":false,"merged":[]}
[]
["N°","NOME (CLIENTE/FORNECEDOR)","ENDEREÇO",null,"COMPLEMENTO","BAIRRO","CIDADE","ESTADO","CEP","TELEFONE/FAX","CPF OU CNPJ","RG OU INSCRIÇÃO ESTADUAL","INSC. MUNICIPAL","DESCONTA ISS","BANCO PARA DEPÓSITO","CÓDIGO DO BANCO","CÓDIGO DA AGÊNCIA","CONTA CORRENTE","CAIXA POSTAL"]
[1," "," ",null," "," "," "," "," "," "," "," "," ",null," "," "," "," "," "," "]
[2,"TILDA & CIA LTDA. - ME","AVENIDA BRASIL",10,"SALA 2","VILA SÃO JORGE","PRESIDENTE PRUDENTE","SÃO PAULO","19.013-000","018 3223-0102","02.494.287/0001-89","11.444.559-8",65896,"DESCONTAR"," "," "," "," "," "]
[3,"LUIZ CARLOS DOS SANTOS","Rua Pacaembu",45,"apto 10","Estádio","Cambé","Parná","18.800-000","043 3390-1515","95.889.889-97","15.555.456-9"," "," "," "," "," "," "," "]
[4," "," "," "," "," "," "," "," "," "," "," "," "," "," "," "," "," "," "]
[5," "," "," "," "," "," "," "," "," "," "," "," ",null," "," "," "," "," "]
[6,null," "," "," "," "," "," "," "," "," "," "," ",null," "," "," "," "," "]
[7,null," "," "," "," "," "," "," "," "," "," "," ",null," "," "," "," "," "," "," "]
[8," "," "," "," "," "," "," "," "," "," "," "," "," "," "," "," "," "," "," "]
[9," "," "," "," "," "," "," "," "," "," "," "," "," "," "," "," "," "," "," "]
[10," "," "," "," "," "," "," "," "," "," "," "," "," "," "," "," "," "," "," "]
[11," "," "," "," "," "," "," "," "," "," "," "," "," "," "," "," "," "," "," "]
[12," "," "," "," "," "," "," "," "," "," "," "," "," "," "," "," "," "," "," "]
[13," "," "," "," "," "," "," "," "," "," "," "," "," "," "," "," "," "," "," "]
[14," "," "," "," "," "," "," "," "," "," "," "," "," "," "," "," "," "," "," "]
[15," "," "," "," "," "," "," "," "," "," "," "," "," "," "," "," "," "," "," "]
[16," "," "," "," "," "," "," "," "," "," "," "," "," "," "," "," "," "," "," "]
[17," "," "," "," "," "," "," "," "," "," "," "," "," "," "," "," "," "," "," "]
[18," "," "," "," "," "," "," "," "," "," "," "," "," "," "," "," "," "," "," "]
[19," "," "," "," "," "," "," "," "," "," "," "," "," "," "," "," "," "," "," "]
[20," "," "," "," "," "," "," "," "," "," "," "," "," "," "," "," "," "," "," "]
[21," "," "," "," "," "," "," "," "," "," "," "," "," "," "," "," "," "," "," "]
[22," "," "," "," "," "," "," "," "," "," "," "," "," "," "," "," "," "," "," "]
[23," "," "," "," "," "," "," "," "," "," "," "," "," "," "," "," "," "," "," "]
[24," "," "," "," "," "," "," "," "," "," "," "," "," "," "," "," "," "," "," "]
[25," "," "," "," "," "," "," "," "," "," "," "," "," "," "," "," "," "," "," "]
[26," "," "," "," "," "," "," "," "," "," "," "," "," "," "," "," "," "," "," "]
[27," "," "," "," "," "," "," "," "," "," "," "," "," "," "," "," "," "," "," "]
[28," "," "," "," "," "," "," "," "," "," "," "," "," "," "," "," "," "," "," "]
[29," "," "," "," "," "," "," "," "," "," "," "," "," "," "," "," "," "," "," "]
[30," "," "," "," "," "," "," "," "," "," "," "," "," "," "," "," "," "," "," "]
[31," "," "," "," "," "," "," "," "," "," "," "," "," "," "," "," "," "," "," "]
[32," "," "," "," "," "," "," "," "," "," "," "," "," "," "," "," "," "," "," "]
[33," "," "," "," "," "," "," "," "," "," "," "," "," "," "," "," "," "," "," "]
[34," "," "," "," "," "," "," "," "," "," "," "," "," "," "," "," "," "," "," "]
[35," "," "," "," "," "," "," "," "," "," "," "," "," "," "," "," "," "," "," "]
[36," "," "," "," "," "," "," "," "," "," "," "," "," "," "," "," "," "," "," "]
[37," "," "," "," "," "," "," "," "," "," "," "," "," "," "," "," "," "," "," "]
[38," "," "," "," "," "," "," "," "," "," "," "," "," "," "," "," "," "," "," "]
[39," "," "," "," "," "," "," "," "," "," "," "," "," "," "," "," "," "," "," "]
[40," "," "," "," "," "," "," "," "," "," "," "," "," "," "," "," "," "," "," "]
[41," "," "," "," "," "," "," "," "," "," "," "," "," "," "," "," "," "," "," "]
[42," "," "," "," "," "," "," "," "," "," "," "," "," "," "," "," "," "," "," "]
[43," "," "," "," "," "," "," "," "," "," "," "," "," "," "," "," "," "," "," "]
[44," "," "," "," "," "," "," "," "," "," "," "," "," "," "," "," "," "," "," "]
[45," "," "," "," "," "," "," "," "," "," "," "," "," "," "," "," "," "," "," "]
[46," "," "," "," "," "," "," "," "," "," "," "," "," "," "," "," "," "," "," "]
[47," "," "," "," "," "," "," "," "," "," "," "," "," "," "," "," "," "," "," "]
[48," "," "," "," "," "," "," "," "," "," "," "," "," "," "," "," "," "," "," "]
[49," "," "," "," "," "," "," "," "," "," "," "," "," "," "," "," "," "," "," "]
[50," "," "," "," "," "," "," "," "," "," "," "," "," "," "," "," "," "," "," "]
[51," "," "," "," "," "," "," "," "," "," "," "," "," "," "," "," "," "," "," "]
[52," "," "," "," "," "," "," "," "," "," "," "," "," "," "," "," "," "," "," "]
[53," "," "," "," "," "," "," "," "," "," "," "," "," "," "," "," "," "," "," "]
[54," "," "," "," "," "," "," "," "," "," "," "," "," "," "," "," "," "," "," "]
[55," "," "," "," "," "," "," "," "," "," "," "," "," "," "," "," "," "," "," "]
[56," "," "," "," "," "," "," "," "," "," "," "," "," "," "," "," "," "," "," "]
[57," "," "," "," "," "," "," "," "," "," "," "," "," "," "," "," "," "," "," "]
[58," "," "," "," "," "," "," "," "," "," "," "," "," "," "," "," "," "," "," "]
[59," "," "," "," "," "," "," "," "," "," "," "," "," "," "," "," "," "," "," "]
[60," "," "," "," "," "," "," "," "," "," "," "," "," "," "," "," "," "," "," "]
[61," "," "," "," "," "," "," "," "," "," "," "," "," "," "," "," "," "," "," "]
[62," "," "," "," "," "," "," "," "," "," "," "," "," "," "," "," "," "," "," "]
[63," "," "," "," "," "," "," "," "," "," "," "," "," "," "," "," "," "," "," "]
[64," "," "," "," "," "," "," "," "," "," "," "," "," "," "," "," "," "," "," "]
[65," "," "," "," "," "," "," "," "," "," "," "," "," "," "," "," "," "," "," "]
[66," "," "," "," "," "," "," "," "," "," "," "," "," "," "," "," "," "," "," "]
[67," "," "," "," "," "," "," "," "," "," "," "," "," "," "," "," "," "," "," "]
[68," "," "," "," "," "," "," "," "," "," "," "," "," "," "," "," "," "," "," "]
[69," "," "," "," "," "," "," "," "," "," "," "," "," "," "," "," "," "," "," "]
[70," "," "," "," "," "," "," "," "," "," "," "," "," "," "," "," "," "," "," "]
[71," "," "," "," "," "," "," "," "," "," "," "," "," "," "," "," "," "," "," "]
[72," "," "," "," "," "," "," "," "," "," "," "," "," "," "," "," "," "," "," "]
[73," "," "," "," "," "," "," "," "," "," "," "," "," "," "," "," "," "," "," "]
[74," "," "," "," "," "," "," "," "," "," "," "," "," "," "," "," "," "," "," "]
[75," "," "," "," "," "," "," "," "," "," "," "," "," "," "," "," "," "," "," "]
[76," "," "," "," "," "," "," "," "," "," "," "," "," "," "," "," "," "," "," "]
[77," "," "," "," "," "," "," "," "," "," "," "," "," "," "," "," "," "," "," "]
[78," "," "," "," "," "," "," "," "," "," "," "," "," "," "," "," "," "," "," "]
[79," "," "," "," "," "," "," "," "," "," "," "," "," "," "," "," "," "," "," "]
[80," "," "," "," "," "," "," "," "," "," "," "," "," "," "," "," "," "," "," "]
[81," "," "," "," "," "," "," "," "," "," "," "," "," "," "," "," "," "," "," "]
[82," "," "," "," "," "," "," "," "," "," "," "," "," "," "," "," "," "," "," "]
[83," "," "," "," "," "," "," "," "," "," "," "," "," "," "," "," "," "," "," "]
[84," "," "," "," "," "," "," "," "," "," "," "," "," "," "," "," "," "," "," "]
[85," "," "," "," "," "," "," "," "," "," "," "," "," "," "," "," "," "," "," "]
[86," "," "," "," "," "," "," "," "," "," "," "," "," "," "," "," "," "," "," "]
[87," "," "," "," "," "," "," "," "," "," "," "," "," "," "," "," "," "," "," "]
[88," "," "," "," "," "," "," "," "," "," "," "," "," "," "," "," "," "," "," "]
[89," "," "," "," "," "," "," "," "," "," "," "," "," "," "," "," "," "," "," "]
[90," "," "," "," "," "," "," "," "," "," "," "," "," "," "," "," "," "," "," "]
[91," "," "," "," "," "," "," "," "," "," "," "," "," "," "," "," "," "," "," "]
[92," "," "," "," "," "," "," "," "," "," "," "," "," "," "," "," "," "," "," "]
[93," "," "," "," "," "," "," "," "," "," "," "," "," "," "," "," "," "," "," "]
[94," "," "," "," "," "," "," "," "," "," "," "," "," "," "," "," "," "," "," "]
[95," "," "," "," "," "," "," "," "," "," "," "," "," "," "," "," "," "," "," "]
[96," "," "," "," "," "," "," "," "," "," "," "," "," "," "," "," "," "," "," "]
[97," "," "," "," "," "," "," "," "," "," "," "," "," "," "," "," "," "," "," "]
[98," "," "," "," "," "," "," "," "," "," "," "," "," "," "," "," "," "," "," "]
[99," "," "," "," "," "," "," "," "," "," "," "," "," "," "," "," "," "," "," "]
[100," "," "," "," "," "," "," "," "," "," "," "," "," "," "," "," "," "," "," "]
[101," "," "," "," "," "," "," "," "," "," "," "," "," "," "," "," "," "," "," "]
[102," "," "," "," "," "," "," "," "," "," "," "," "," "," "," "," "," "," "," "]
[103," "," "," "," "," "," "," "," "," "," "," "," "," "," "," "," "," "," "," "]
[104," "," "," "," "," "," "," "," "," "," "," "," "," "," "," "," "," "," "," "]
[105," "," "," "," "," "," "," "," "," "," "," "," "," "," "," "," "," "," "," "]
[106," "," "," "," "," "," "," "," "," "," "," "," "," "," "," "," "," "," "," "]
[107," "," "," "," "," "," "," "," "," "," "," "," "," "," "," "," "," "," "," "]
[108," "," "," "," "," "," "," "," "," "," "," "," "," "," "," "," "," "," "," "]
[109," "," "," "," "," "," "," "," "," "," "," "," "," "," "," "," "," "," "," "]
[110," "," "," "," "," "," "," "," "," "," "," "," "," "," "," "," "," "," "," "]
[111," "," "," "," "," "," "," "," "," "," "," "," "," "," "," "," "," "," "," "]
[112," "," "," "," "," "," "," "," "," "," "," "," "," "," "," "," "," "," "," "]
[113," "," "," "," "," "," "," "," "," "," "," "," "," "," "," "," "," "," "," "]
[114," "," "," "," "," "," "," "," "," "," "," "," "," "," "," "," "," "," "," "]
[115," "," "," "," "," "," "," "," "," "," "," "," "," "," "," "," "," "," "," "]
[116," "," "," "," "," "," "," "," "," "," "," "," "," "," "," "," "," "," "," "]
[117," "," "," "," "," "," "," "," "," "," "," "," "," "," "," "," "," "," "," "]
[118," "," "," "," "," "," "," "," "," "," "," "," "," "," "," "," "," "," "," "]
[119," "," "," "," "," "," "," "," "," "," "," "," "," "," "," "," "," "," "," "]
[120," "," "," "," "," "," "," "," "," "," "," "," "," "," "," "," "," "," "," "]
[121," "," "," "," "," "," "," "," "," "," "," "," "," "," "," "," "," "," "," "]
[122," "," "," "," "," "," "," "," "," "," "," "," "," "," "," "," "," "," "," "]
[123," "," "," "," "," "," "," "," "," "," "," "," "," "," "," "," "," "," "," "]
[124," "," "," "," "," "," "," "," "," "," "," "," "," "," "," "," "," "," "," "]
[125," "," "," "," "," "," "," "," "," "," "," "," "," "," "," "," "," "," "," "]
[126," "," "," "," "," "," "," "," "," "," "," "," "," "," "," "," "," "," "," "]
[127," "," "," "," "," "," "," "," "," "," "," "," "," "," "," "," "," "," "," "]
[128," "," "," "," "," "," "," "," "," "," "," "," "," "," "," "," "," "," "," "]
[129," "," "," "," "," "," "," "," "," "," "," "," "," "," "," "," "," "," "," "]
[130," "," "," "," "," "," "," "," "," "," "," "," "," "," "," "," "," "," "," "]
[131," "," "," "," "," "," "," "," "," "," "," "," "," "," "," "," "," "," "," "]
[132," "," "," "," "," "," "," "," "," "," "," "," "," "," "," "," "," "," "," "]
[133," "," "," "," "," "," "," "," "," "," "," "," "," "," "," "," "," "," "," "]
[134," "," "," "," "," "," "," "," "," "," "," "," "," "," "," "," "," "," "," "]
[135," "," "," "," "," "," "," "," "," "," "," "," "," "," "," "," "," "," "," "]
[136," "," "," "," "," "," "," "," "," "," "," "," "," "," "," "," "," "," "," "]
[137," "," "," "," "," "," "," "," "," "," "," "," "," "," "," "," "," "," "," "]
[138," "," "," "," "," "," "," "," "," "," "," "," "," "," "," "," "," "," "," "]
[139," "," "," "," "," "," "," "," "," "," "," "," "," "," "," "," "," "," "," "]
[140," "," "," "," "," "," "," "," "," "," "," "," "," "," "," "," "," "," "," "]
[141," "," "," "," "," "," "," "," "," "," "," "," "," "," "," "," "," "," "," "]
[142," "," "," "," "," "," "," "," "," "," "," "," "," "," "," "," "," "," "," "]
[143," "," "," "," "," "," "," "," "," "," "," "," "," "," "," "," "," "," "," "]
[144," "," "," "," "," "," "," "," "," "," "," "," "," "," "," "," "," "," "," "]
[145," "," "," "," "," "," "," "," "," "," "," "," "," "," "," "," "," "," "," "]
[146," "," "," "," "," "," "," "," "," "," "," "," "," "," "," "," "," "," "," "]
[147," "," "," "," "," "," "," "," "," "," "," "," "," "," "," "," "," "," "," "]
[148," "," "," "," "," "," "," "," "," "," "," "," "," "," "," "," "," "," "," "]
[149," "," "," "," "," "," "," "," "," "," "," "," "," "," "," "," "," "," "," "]
[150," "," "," "," "," "," "," "," "," "," "," "," "," "," "," "," "," "," "," "]
[151," "," "," "," "," "," "," "," "," "," "," "," "," "," "," "," "," "," "," "]
[152," "," "," "," "," "," "," "," "," "," "," "," "," "," "," "," "," "," "," "]
[153," "," "," "," "," "," "," "," "," "," "," "," "," "," "," "," "," "," "," "]
[154," "," "," "," "," "," "," "," "," "," "," "," "," "," "," "," "," "," "," "]
[155," "," "," "," "," "," "," "," "," "," "," "," "," "," "," "," "," "," "," "]
[156," "," "," "," "," "," "," "," "," "," "," "," "," "," "," "," "," "," "," "]
[157," "," "," "," "," "," "," "," "," "," "," "," "," "," "," "," "," "," "," "]
[158," "," "," "," "," "," "," "," "," "," "," "," "," "," "," "," "," "," "," "]
[159," "," "," "," "," "," "," "," "," "," "," "," "," "," "," "," "," "," "," "]
[160," "," "," "," "," "," "," "," "," "," "," "," "," "," "," "," "," "," "," "]
[161," "," "," "," "," "," "," "," "," "," "," "," "," "," "," "," "," "," "," "]
[162," "," "," "," "," "," "," "," "," "," "," "," "," "," "," "," "," "," "," "]
[163," "," "," "," "," "," "," "," "," "," "," "," "," "," "," "," "," "," "," "]
[164," "," "," "," "," "," "," "," "," "," "," "," "," "," "," "," "," "," "," "]
[165," "," "," "," "," "," "," "," "," "," "," "," "," "," "," "," "," "," "," "]
[166," "," "," "," "," "," "," "," "," "," "," "," "," "," "," "," "," "," "," "]
[167," "," "," "," "," "," "," "," "," "," "," "," "," "," "," "," "," "," "," "]
[168," "," "," "," "," "," "," "," "," "," "," "," "," "," "," "," "," "," "," "]
[169," "," "," "," "," "," "," "," "," "," "," "," "," "," "," "," "," "," "," "]
[170," "," "," "," "," "," "," "," "," "," "," "," "," "," "," "," "," "," "," "]
[171," "," "," "," "," "," "," "," "," "," "," "," "," "," "," "," "," "," "," "]
[172," "," "," "," "," "," "," "," "," "," "," "," "," "," "," "," "," "," "," "]
[173," "," "," "," "," "," "," "," "," "," "," "," "," "," "," "," "," "," "," "]
[174," "," "," "," "," "," "," "," "," "," "," "," "," "," "," "," "," "," "," "]
[175," "," "," "," "," "," "," "," "," "," "," "," "," "," "," "," "," "," "," "]
[176," "," "," "," "," "," "," "," "," "," "," "," "," "," "," "," "," "," "," "]
[177," "," "," "," "," "," "," "," "," "," "," "," "," "," "," "," "," "," "," "]
[178," "," "," "," "," "," "," "," "," "," "," "," "," "," "," "," "," "," "," "]
[179," "," "," "," "," "," "," "," "," "," "," "," "," "," "," "," "," "," "," "]
[180," "," "," "," "," "," "," "," "," "," "," "," "," "," "," "," "," "," "," "]
[181," "," "," "," "," "," "," "," "," "," "," "," "," "," "," "," "," "," "," "]
[182," "," "," "," "," "," "," "," "," "," "," "," "," "," "," "," "," "," "," "]
[183," "," "," "," "," "," "," "," "," "," "," "," "," "," "," "," "," "," "," "]
[184," "," "," "," "," "," "," "," "," "," "," "," "," "," "," "," "," "," "," "]
[185," "," "," "," "," "," "," "," "," "," "," "," "," "," "," "," "," "," "," "]
[186," "," "," "," "," "," "," "," "," "," "," "," "," "," "," "," "," "," "," "]
[187," "," "," "," "," "," "," "," "," "," "," "," "," "," "," "," "," "," "," "]
[188," "," "," "," "," "," "," "," "," "," "," "," "," "," "," "," "," "," "," "]
[189," "," "," "," "," "," "," "," "," "," "," "," "," "," "," "," "," "," "," "]
[190," "," "," "," "," "," "," "," "," "," "," "," "," "," "," "," "," "," "," "]
[191," "," "," "," "," "," "," "," "," "," "," "," "," "," "," "," "," "," "," "]
[192," "," "," "," "," "," "," "," "," "," "," "," "," "," "," "," "," "," "," "]
[193," "," "," "," "," "," "," "," "," "," "," "," "," "," "," "," "," "," "," "]
[194," "," "," "," "," "," "," "," "," "," "," "," "," "," "," "," "," "," "," "]
[195," "," "," "," "," "," "," "," "," "," "," "," "," "," "," "," "," "," "," "]
[196," "," "," "," "," "," "," "," "," "," "," "," "," "," "," "," "," "," "," "]
[197," "," "," "," "," "," "," "," "," "," "," "," "," "," "," "," "," "," "," "]
[198," "," "," "," "," "," "," "," "," "," "," "," "," "," "," "," "," "," "," "]
[199," "," "," "," "," "," "," "," "," "," "," "," "," "," "," "," "," "," "," "]
[200," "," "," "," "," "," "," "," "," "," "," "," "," "," "," "," "," "," "," "]
[201," "," "," "," "," "," "," "," "," "," "," "," "," "," "," "," "," "," "," "]
[202," "," "," "," "," "," "," "," "," "," "," "," "," "," "," "," "," "," "," "]
[203," "," "," "," "," "," "," "," "," "," "," "," "," "," "," "," "," "," "," "]
[204," "," "," "," "," "," "," "," "," "," "," "," "," "," "," "," "," "," "," "]
[205," "," "," "," "," "," "," "," "," "," "," "," "," "," "," "," "," "," "," "]
[206," "," "," "," "," "," "," "," "," "," "," "," "," "," "," "," "," "," "," "]
[207," "," "," "," "," "," "," "," "," "," "," "," "," "," "," "," "," "," "," "]
[208," "," "," "," "," "," "," "," "," "," "," "," "," "," "," "," "," "," "," "]
[209," "," "," "," "," "," "," "," "," "," "," "," "," "," "," "," "," "," "," "]
[210," "," "," "," "," "," "," "," "," "," "," "," "," "," "," "," "," "," "," "]
[211," "," "," "," "," "," "," "," "," "," "," "," "," "," "," "," "," "," "," "]
[212," "," "," "," "," "," "," "," "," "," "," "," "," "," "," "," "," "," "," "]
[213," "," "," "," "," "," "," "," "," "," "," "," "," "," "," "," "," "," "," "]
[214," "," "," "," "," "," "," "," "," "," "," "," "," "," "," "," "," "," "," "]
[215," "," "," "," "," "," "," "," "," "," "," "," "," "," "," "," "," "," "," "]
[216," "," "," "," "," "," "," "," "," "," "," "," "," "," "," "," "," "," "," "]
[217," "," "," "," "," "," "," "," "," "," "," "," "," "," "," "," "," "," "," "]
[218," "," "," "," "," "," "," "," "," "," "," "," "," "," "," "," "," "," "," "]
[219," "," "," "," "," "," "," "," "," "," "," "," "," "," "," "," "," "," "," "]
[220," "," "," "," "," "," "," "," "," "," "," "," "," "," "," "," "," "," "," "]
[221," "," "," "," "," "," "," "," "," "," "," "," "," "," "," "," "," "," "," "]
[222," "," "," "," "," "," "," "," "," "," "," "," "," "," "," "," "," "," "," "]
[223," "," "," "," "," "," "," "," "," "," "," "," "," "," "," "," "," "," "," "]
[224," "," "," "," "," "," "," "," "," "," "," "," "," "," "," "," "," "," "," "]
[225," "," "," "," "," "," "," "," "," "," "," "," "," "," "," "," "," "," "," "]
[226," "," "," "," "," "," "," "," "," "," "," "," "," "," "," "," "," "," "," "]
[227," "," "," "," "," "," "," "," "," "," "," "," "," "," "," "," "," "," "," "]
[228," "," "," "," "," "," "," "," "," "," "," "," "," "," "," "," "," "," "," "]
[229," "," "," "," "," "," "," "," "," "," "," "," "," "," "," "," "," "," "," "]
[230," "," "," "," "," "," "," "," "," "," "," "," "," "," "," "," "," "," "," "]
[231," "," "," "," "," "," "," "," "," "," "," "," "," "," "," "," "," "," "," "]
[232," "," "," "," "," "," "," "," "," "," "," "," "," "," "," "," "," "," "," "]
[233," "," "," "," "," "," "," "," "," "," "," "," "," "," "," "," "," "," "," "]
[234," "," "," "," "," "," "," "," "," "," "," "," "," "," "," "," "," "," "," "]
[235," "," "," "," "," "," "," "," "," "," "," "," "," "," "," "," "," "," "," "]
[236," "," "," "," "," "," "," "," "," "," "," "," "," "," "," "," "," "," "," "]
[237," "," "," "," "," "," "," "," "," "," "," "," "," "," "," "," "," "," "," "]
[238," "," "," "," "," "," "," "," "," "," "," "," "," "," "," "," "," "," "," "]
[239," "," "," "," "," "," "," "," "," "," "," "," "," "," "," "," "," "," "," "]
[240," "," "," "," "," "," "," "," "," "," "," "," "," "," "," "," "," "," "," "]
[241," "," "," "," "," "," "," "," "," "," "," "," "," "," "," "," "," "," "," "]
[242," "," "," "," "," "," "," "," "," "," "," "," "," "," "," "," "," "," "," "]
[243," "," "," "," "," "," "," "," "," "," "," "," "," "," "," "," "," "," "," "]
[244," "," "," "," "," "," "," "," "," "," "," "," "," "," "," "," "," "," "," "]
[245," "," "," "," "," "," "," "," "," "," "," "," "," "," "," "," "," "," "," "]
[246," "," "," "," "," "," "," "," "," "," "," "," "," "," "," "," "," "," "," "]
[247," "," "," "," "," "," "," "," "," "," "," "," "," "," "," "," "," "," "," "]
[248," "," "," "," "," "," "," "," "," "," "," "," "," "," "," "," "," "," "," "]
[249," "," "," "," "," "," "," "," "," "," "," "," "," "," "," "," "," "," "," "]
[250," "," "," "," "," "," "," "," "," "," "," "," "," "," "," "," "," "," "," "]
[251," "," "," "," "," "," "," "," "," "," "," "," "," "," "," "," "," "," "," "]
[252," "," "," "," "," "," "," "," "," "," "," "," "," "," "," "," "," "," "," "]
[253," "," "," "," "," "," "," "," "," "," "," "," "," "," "," "," "," "," "," "]
[254," "," "," "," "," "," "," "," "," "," "," "," "," "," "," "," "," "," "," "]
[255," "," "," "," "," "," "," "," "," "," "," "," "," "," "," "," "," "," "," "]
[256," "," "," "," "," "," "," "," "," "," "," "," "," "," "," "," "," "," "," "]
[257," "," "," "," "," "," "," "," "," "," "," "," "," "," "," "," "," "," "," "]
[258," "," "," "," "," "," "," "," "," "," "," "," "," "," "," "," "," "," "," "]
[259," "," "," "," "," "," "," "," "," "," "," "," "," "," "," "," "," "," "," "]
[260," "," "," "," "," "," "," "," "," "," "," "," "," "," "," "," "," "," "," "]
[261," "," "," "," "," "," "," "," "," "," "," "," "," "," "," "," "," "," "," "]
[262," "," "," "," "," "," "," "," "," "," "," "," "," "," "," "," "," "," "," "]
[263," "," "," "," "," "," "," "," "," "," "," "," "," "," "," "," "," "," "," "]
[264," "," "," "," "," "," "," "," "," "," "," "," "," "," "," "," "," "," "," "]
[265," "," "," "," "," "," "," "," "," "," "," "," "," "," "," "," "," "," "," "]
[266," "," "," "," "," "," "," "," "," "," "," "," "," "," "," "," "," "," "," "]
[267," "," "," "," "," "," "," "," "," "," "," "," "," "," "," "," "," "," "," "]
[268," "," "," "," "," "," "," "," "," "," "," "," "," "," "," "," "," "," "," "]
[269," "," "," "," "," "," "," "," "," "," "," "," "," "," "," "," "," "," "," "]
[270," "," "," "," "," "," "," "," "," "," "," "," "," "," "," "," "," "," "," "]
[271," "," "," "," "," "," "," "," "," "," "," "," "," "," "," "," "," "," "," "]
[272," "," "," "," "," "," "," "," "," "," "," "," "," "," "," "," "," "," "," "]
[273," "," "," "," "," "," "," "," "," "," "," "," "," "," "," "," "," "," "," "]
[274," "," "," "," "," "," "," "," "," "," "," "," "," "," "," "," "," "," "," "]
[275," "," "," "," "," "," "," "," "," "," "," "," "," "," "," "," "," "," "," "]
[276," "," "," "," "," "," "," "," "," "," "," "," "," "," "," "," "," "," "," "]
[277," "," "," "," "," "," "," "," "," "," "," "," "," "," "," "," "," "," "," "]
[278," "," "," "," "," "," "," "," "," "," "," "," "," "," "," "," "," "," "," "]
[279," "," "," "," "," "," "," "," "," "," "," "," "," "," "," "," "," "," "," "]
[280," "," "," "," "," "," "," "," "," "," "," "," "," "," "," "," "," "," "," "]
[281," "," "," "," "," "," "," "," "," "," "," "," "," "," "," "," "," "," "," "]
[282," "," "," "," "," "," "," "," "," "," "," "," "," "," "," "," "," "," "," "]
[283," "," "," "," "," "," "," "," "," "," "," "," "," "," "," "," "," "," "," "]
[284," "," "," "," "," "," "," "," "," "," "," "," "," "," "," "," "," "," "," "]
[285," "," "," "," "," "," "," "," "," "," "," "," "," "," "," "," "," "," "," "]
[286," "," "," "," "," "," "," "," "," "," "," "," "," "," "," "," "," "," "," "]
[287," "," "," "," "," "," "," "," "," "," "," "," "," "," "," "," "," "," "," "]
[288," "," "," "," "," "," "," "," "," "," "," "," "," "," "," "," "," "," "," "]
[289," "," "," "," "," "," "," "," "," "," "," "," "," "," "," "," "," "," "," "]
[290," "," "," "," "," "," "," "," "," "," "," "," "," "," "," "," "," "," "," "]
[291," "," "," "," "," "," "," "," "," "," "," "," "," "," "," "," "," "," "," "]
[292," "," "," "," "," "," "," "," "," "," "," "," "," "," "," "," "," "," "," "]
[293," "," "," "," "," "," "," "," "," "," "," "," "," "," "," "," "," "," "," "]
[294," "," "," "," "," "," "," "," "," "," "," "," "," "," "," "," "," "," "," "]
[295," "," "," "," "," "," "," "," "," "," "," "," "," "," "," "," "," "," "," "]
[296," "," "," "," "," "," "," "," "," "," "," "," "," "," "," "," "," "," "," "]
[297," "," "," "," "," "," "," "," "," "," "," "," "," "," "," "," "," "," "," "]
[298," "," "," "," "," "," "," "," "," "," "," "," "," "," "," "," "," "," "," "]
[299," "," "," "," "," "," "," "," "," "," "," "," "," "," "," "," "," "," "," "]
[300," "," "," "," "," "," "," "," "," "," "," "," "," "," "," "," "," "," "," "]
[301," "," "," "," "," "," "," "," "," "," "," "," "," "," "," "," "," "," "," "]
[302," "," "," "," "," "," "," "," "," "," "," "," "," "," "," "," "," "," "," "]
[303," "," "," "," "," "," "," "," "," "," "," "," "," "," "," "," "," "," "," "]
[304," "," "," "," "," "," "," "," "," "," "," "," "," "," "," "," "," "," "," "]
[305," "," "," "," "," "," "," "," "," "," "," "," "," "," "," "," "," "," "," "]
[306," "," "," "," "," "," "," "," "," "," "," "," "," "," "," "," "," "," "," "]
[307," "," "," "," "," "," "," "," "," "," "," "," "," "," "," "," "," "," "," "]
[308," "," "," "," "," "," "," "," "," "," "," "," "," "," "," "," "," "," "," "]
[309," "," "," "," "," "," "," "," "," "," "," "," "," "," "," "," "," "," "," "]
[310," "," "," "," "," "," "," "," "," "," "," "," "," "," "," "," "," "," "," "]
[311," "," "," "," "," "," "," "," "," "," "," "," "," "," "," "," "," "," "," "]
[312," "," "," "," "," "," "," "," "," "," "," "," "," "," "," "," "," "," "," "]
[313," "," "," "," "," "," "," "," "," "," "," "," "," "," "," "," "," "," "," "]
[314," "," "," "," "," "," "," "," "," "," "," "," "," "," "," "," "," "," "," "]
[315," "," "," "," "," "," "," "," "," "," "," "," "," "," "," "," "," "," "," "]
[316," "," "," "," "," "," "," "," "," "," "," "," "," "," "," "," "," "," "," "]
[317," "," "," "," "," "," "," "," "," "," "," "," "," "," "," "," "," "," "," "]
[318," "," "," "," "," "," "," "," "," "," "," "," "," "," "," "," "," "," "," "]
[319," "," "," "," "," "," "," "," "," "," "," "," "," "," "," "," "," "," "," "]
[320," "," "," "," "," "," "," "," "," "," "," "," "," "," "," "," "," "," "," "]
[321," "," "," "," "," "," "," "," "," "," "," "," "," "," "," "," "," "," "," "]
[322," "," "," "," "," "," "," "," "," "," "," "," "," "," "," "," "," "," "," "]
[323," "," "," "," "," "," "," "," "," "," "," "," "," "," "," "," "," "," "," "]
[324," "," "," "," "," "," "," "," "," "," "," "," "," "," "," "," "," "," "," "]
[325," "," "," "," "," "," "," "," "," "," "," "," "," "," "," "," "," "," "," "]
[326," "," "," "," "," "," "," "," "," "," "," "," "," "," "," "," "," "," "," "]
[327," "," "," "," "," "," "," "," "," "," "," "," "," "," "," "," "," "," "," "]
[328," "," "," "," "," "," "," "," "," "," "," "," "," "," "," "," "," "," "," "]
[329," "," "," "," "," "," "," "," "," "," "," "," "," "," "," "," "," "," "," "]
[330," "," "," "," "," "," "," "," "," "," "," "," "," "," "," "," "," "," "," "]
[331," "," "," "," "," "," "," "," "," "," "," "," "," "," "," "," "," "," "," "]
[332," "," "," "," "," "," "," "," "," "," "," "," "," "," "," "," "," "," "," "]
[333," "," "," "," "," "," "," "," "," "," "," "," "," "," "," "," "," "," "," "]
[334," "," "," "," "," "," "," "," "," "," "," "," "," "," "," "," "," "," "," "]
[335," "," "," "," "," "," "," "," "," "," "," "," "," "," "," "," "," "," "," "]
[336," "," "," "," "," "," "," "," "," "," "," "," "," "," "," "," "," "," "," "]
[337," "," "," "," "," "," "," "," "," "," "," "," "," "," "," "," "," "," "," "]
[338," "," "," "," "," "," "," "," "," "," "," "," "," "," "," "," "," "," "," "]
[339," "," "," "," "," "," "," "," "," "," "," "," "," "," "," "," "," "," "," "]
[340," "," "," "," "," "," "," "," "," "," "," "," "," "," "," "," "," "," "," "]
[341," "," "," "," "," "," "," "," "," "," "," "," "," "," "," "," "," "," "," "]
[342," "," "," "," "," "," "," "," "," "," "," "," "," "," "," "," "," "," "," "]
[343," "," "," "," "," "," "," "," "," "," "," "," "," "," "," "," "," "," "," "]
[344," "," "," "," "," "," "," "," "," "," "," "," "," "," "," "," "," "," "," "]
[345," "," "," "," "," "," "," "," "," "," "," "," "," "," "," "," "," "," "," "]
[346," "," "," "," "," "," "," "," "," "," "," "," "," "," "," "," "," "," "," "]
[347," "," "," "," "," "," "," "," "," "," "," "," "," "," "," "," "," "," "," "]
[348," "," "," "," "," "," "," "," "," "," "," "," "," "," "," "," "," "," "," "]
[349," "," "," "," "," "," "," "," "," "," "," "," "," "," "," "," "," "," "," "]
[350," "," "," "," "," "," "," "," "," "," "," "," "," "," "," "," "," "," "," "]
[351," "," "," "," "," "," "," "," "," "," "," "," "," "," "," "," "," "," "," "]
[352," "," "," "," "," "," "," "," "," "," "," "," "," "," "," "," "," "," "," "]
[353," "," "," "," "," "," "," "," "," "," "," "," "," "," "," "," "," "," "," "]
[354," "," "," "," "," "," "," "," "," "," "," "," "," "," "," "," "," "," "," "]
[355," "," "," "," "," "," "," "," "," "," "," "," "," "," "," "," "," "," "," "]
[356," "," "," "," "," "," "," "," "," "," "," "," "," "," "," "," "," "," "," "]
[357," "," "," "," "," "," "," "," "," "," "," "," "," "," "," "," "," "," "," "]
[358," "," "," "," "," "," "," "," "," "," "," "," "," "," "," "," "," "," "," "]
[360," "," "," "," "," "," "," "," "," "," "," "," "," "," "," "," "," "," "," "]
[361," "," "," "," "," "," "," "," "," "," "," "," "," "," "," "," "," "," "," "]
[362," "," "," "," "," "," "," "," "," "," "," "," "," "," "," "," "," "," "," "]
[363," "," "," "," "," "," "," "," "," "," "," "," "," "," "," "," "," "," "," "]
[364," "," "," "," "," "," "," "," "," "," "," "," "," "," "," "," "," "," "," "]
[365," "," "," "," "," "," "," "," "," "," "," "," "," "," "," "," "," "," "," "]
[366," "," "," "," "," "," "," "," "," "," "," "," "," "," "," "," "," "," "," "]
[367," "," "," "," "," "," "," "," "," "," "," "," "," "," "," "," "," "," "," "]
[368," "," "," "," "," "," "," "," "," "," "," "," "," "," "," "," "," "," "," "]
[369," "," "," "," "," "," "," "," "," "," "," "," "," "," "," "," "," "," "," "]
[370," "," "," "," "," "," "," "," "," "," "," "," "," "," "," "," "," "," "," "]
[371," "," "," "," "," "," "," "," "," "," "," "," "," "," "," "," "," "," "," "]
[372," "," "," "," "," "," "," "," "," "," "," "," "," "," "," "," "," "," "," "]
[373," "," "," "," "," "," "," "," "," "," "," "," "," "," "," "," "," "," "," "]
[374," "," "," "," "," "," "," "," "," "," "," "," "," "," "," "," "," "," "," "]
[375," "," "," "," "," "," "," "," "," "," "," "," "," "," "," "," "," "," "," "]
[376," "," "," "," "," "," "," "," "," "," "," "," "," "," "," "," "," "," "," "]
[377," "," "," "," "," "," "," "," "," "," "," "," "," "," "," "," "," "," "," "]
[378," "," "," "," "," "," "," "," "," "," "," "," "," "," "," "," "," "," "," "]
[379," "," "," "," "," "," "," "," "," "," "," "," "," "," "," "," "," "," "," "]
[380," "," "," "," "," "," "," "," "," "," "," "," "," "," "," "," "," "," "," "]
[381," "," "," "," "," "," "," "," "," "," "," "," "," "," "," "," "," "," "," "]
[382," "," "," "," "," "," "," "," "," "," "," "," "," "," "," "," "," "," "," "]
[383," "," "," "," "," "," "," "," "," "," "," "," "," "," "," "," "," "," "," "]
[384," "," "," "," "," "," "," "," "," "," "," "," "," "," "," "," "," "," "," "]
[385," "," "," "," "," "," "," "," "," "," "," "," "," "," "," "," "," "," "," "]
[386," "," "," "," "," "," "," "," "," "," "," "," "," "," "," "," "," "," "," "]
[387," "," "," "," "," "," "," "," "," "," "," "," "," "," "," "," "," "," "," "]
[388," "," "," "," "," "," "," "," "," "," "," "," "," "," "," "," "," "," "," "]
[389," "," "," "," "," "," "," "," "," "," "," "," "," "," "," "," "," "," "," "]
[390," "," "," "," "," "," "," "," "," "," "," "," "," "," "," "," "," "," "," "]
[391," "," "," "," "," "," "," "," "," "," "," "," "," "," "," "," "," "," "," "]
[392," "," "," "," "," "," "," "," "," "," "," "," "," "," "," "," "," "," "," "]
[393," "," "," "," "," "," "," "," "," "," "," "," "," "," "," "," "," "," "," "]
[394," "," "," "," "," "," "," "," "," "," "," "," "," "," "," "," "," "," "," "]
[395," "," "," "," "," "," "," "," "," "," "," "," "," "," "," "," "," "," "," "]
[396," "," "," "," "," "," "," "," "," "," "," "," "," "," "," "," "," "," "," "]
[397," "," "," "," "," "," "," "," "," "," "," "," "," "," "," "," "," "," "," "]
[398," "," "," "," "," "," "," "," "," "," "," "," "," "," "," "," "," "," "," "]
[399," "," "," "," "," "," "," "," "," "," "," "," "," "," "," "," "," "," "," "]
[400," "," "," "," "," "," "," "," "," "," "," "," "," "," "," "," "," "," "," "]
[401," "," "," "," "," "," "," "," "," "," "," "," "," "," "," "," "," "," "," "]
[402," "," "," "," "," "," "," "," "," "," "," "," "," "," "," "," "," "," "," "]
[403," "," "," "," "," "," "," "," "," "," "," "," "," "," "," "," "," "," "," "]
[404," "," "," "," "," "," "," "," "," "," "," "," "," "," "," "," "," "," "," "]
[405," "," "," "," "," "," "," "," "," "," "," "," "," "," "," "," "," "," "," "]
[406," "," "," "," "," "," "," "," "," "," "," "," "," "," "," "," "," "," "," "]
[407," "," "," "," "," "," "," "," "," "," "," "," "," "," "," "," "," "," "," "]
[408," "," "," "," "," "," "," "," "," "," "," "," "," "," "," "," "," "," "," "]
[409," "," "," "," "," "," "," "," "," "," "," "," "," "," "," "," "," "," "," "]
[410," "," "," "," "," "," "," "," "," "," "," "," "," "," "," "," "," "," "," "]
[411," "," "," "," "," "," "," "," "," "," "," "," "," "," "," "," "," "," "," "]
[412," "," "," "," "," "," "," "," "," "," "," "," "," "," "," "," "," "," "," "]
[413," "," "," "," "," "," "," "," "," "," "," "," "," "," "," "," "," "," "," "]
[414," "," "," "," "," "," "," "," "," "," "," "," "," "," "," "," "," "," "," "]
[415," "," "," "," "," "," "," "," "," "," "," "," "," "," "," "," "," "," "," "]
[416," "," "," "," "," "," "," "," "," "," "," "," "," "," "," "," "," "," "," "]
[417," "," "," "," "," "," "," "," "," "," "," "," "," "," "," "," "," "," "," "]
[418," "," "," "," "," "," "," "," "," "," "," "," "," "," "," "," "," "," "," "]
[419," "," "," "," "," "," "," "," "," "," "," "," "," "," "," "," "," "," "," "]
[420," "," "," "," "," "," "," "," "," "," "," "," "," "," "," "," "," "," "," "]
[421," "," "," "," "," "," "," "," "," "," "," "," "," "," "," "," "," "," "," "]
[422," "," "," "," "," "," "," "," "," "," "," "," "," "," "," "," "," "," "," "]
[423," "," "," "," "," "," "," "," "," "," "," "," "," "," "," "," "," "," "," "]
[424," "," "," "," "," "," "," "," "," "," "," "," "," "," "," "," "," "," "," "]
[425," "," "," "," "," "," "," "," "," "," "," "," "," "," "," "," "," "," "," "]
[426," "," "," "," "," "," "," "," "," "," "," "," "," "," "," "," "," "," "," "]
[427," "," "," "," "," "," "," "," "," "," "," "," "," "," "," "," "," "," "," "]
[428," "," "," "," "," "," "," "," "," "," "," "," "," "," "," "," "," "," "," "]
[429," "," "," "," "," "," "," "," "," "," "," "," "," "," "," "," "," "," "," "]
[430," "," "," "," "," "," "," "," "," "," "," "," "," "," "," "," "," "," "," "]
[431," "," "," "," "," "," "," "," "," "," "," "," "," "," "," "," "," "," "," "]
[432," "," "," "," "," "," "," "," "," "," "," "," "," "," "," "," "," "," "," "]
[433," "," "," "," "," "," "," "," "," "," "," "," "," "," "," "," "," "," "," "]
[434," "," "," "," "," "," "," "," "," "," "," "," "," "," "," "," "," "," "," "]
[435," "," "," "," "," "," "," "," "," "," "," "," "," "," "," "," "," "," "," "]
[436," "," "," "," "," "," "," "," "," "," "," "," "," "," "," "," "," "," "," "]
[437," "," "," "," "," "," "," "," "," "," "," "," "," "," "," "," "," "," "," "]
[438," "," "," "," "," "," "," "," "," "," "," "," "," "," "," "," "," "," "," "]
[439," "," "," "," "," "," "," "," "," "," "," "," "," "," "," "," "," "," "," "]
[440," "," "," "," "," "," "," "," "," "," "," "," "," "," "," "," "," "," "," "]
[441," "," "," "," "," "," "," "," "," "," "," "," "," "," "," "," "," "," "," "]
[442," "," "," "," "," "," "," "," "," "," "," "," "," "," "," "," "," "," "," "]
[443," "," "," "," "," "," "," "," "," "," "," "," "," "," "," "," "," "," "," "]
[444," "," "," "," "," "," "," "," "," "," "," "," "," "," "," "," "," "," "," "]
[445," "," "," "," "," "," "," "," "," "," "," "," "," "," "," "," "," "," "," "]
[446," "," "," "," "," "," "," "," "," "," "," "," "," "," "," "," "," "," "," "]
[447," "," "," "," "," "," "," "," "," "," "," "," "," "," "," "," "," "," "," "]
[448," "," "," "," "," "," "," "," "," "," "," "," "," "," "," "," "," "," "," "]
[449," "," "," "," "," "," "," "," "," "," "," "," "," "," "," "," "," "," "," "]
[450," "," "," "," "," "," "," "," "," "," "," "," "," "," "," "," "," "," "," "]
[451," "," "," "," "," "," "," "," "," "," "," "," "," "," "," "," "," "," "," "]
[452," "," "," "," "," "," "," "," "," "," "," "," "," "," "," "," "," "," "," "]
[453," "," "," "," "," "," "," "," "," "," "," "," "," "," "," "," "," "," "," "]
[454," "," "," "," "," "," "," "," "," "," "," "," "," "," "," "," "," "," "," "]
[455," "," "," "," "," "," "," "," "," "," "," "," "," "," "," "," "," "," "," "]
[456," "," "," "," "," "," "," "," "," "," "," "," "," "," "," "," "," "," "," "]
[457," "," "," "," "," "," "," "," "," "," "," "," "," "," "," "," "," "," "," "]
[458," "," "," "," "," "," "," "," "," "," "," "," "," "," "," "," "," "," "," "]
[459," "," "," "," "," "," "," "," "," "," "," "," "," "," "," "," "," "," "," "]
[460," "," "," "," "," "," "," "," "," "," "," "," "," "," "," "," "," "," "," "]
[461," "," "," "," "," "," "," "," "," "," "," "," "," "," "," "," "," "," "," "]
[462," "," "," "," "," "," "," "," "," "," "," "," "," "," "," "," "," "," "," "]
[463," "," "," "," "," "," "," "," "," "," "," "," "," "," "," "," "," "," "," "]
[464," "," "," "," "," "," "," "," "," "," "," "," "," "," "," "," "," "," "," "]
[465," "," "," "," "," "," "," "," "," "," "," "," "," "," "," "," "," "," "," "]
[466," "," "," "," "," "," "," "," "," "," "," "," "," "," "," "," "," "," "," "]
[467," "," "," "," "," "," "," "," "," "," "," "," "," "," "," "," "," "," "," "]
[468," "," "," "," "," "," "," "," "," "," "," "," "," "," "," "," "," "," "," "]
[469," "," "," "," "," "," "," "," "," "," "," "," "," "," "," "," "," "," "," "]
[470," "," "," "," "," "," "," "," "," "," "," "," "," "," "," "," "," "," "," "]
[471," "," "," "," "," "," "," "," "," "," "," "," "," "," "," "," "," "," "," "]
[472," "," "," "," "," "," "," "," "," "," "," "," "," "," "," "," "," "," "," "]
[473," "," "," "," "," "," "," "," "," "," "," "," "," "," "," "," "," "," "," "]
[474," "," "," "," "," "," "," "," "," "," "," "," "," "," "," "," "," "," "," "]
[475," "," "," "," "," "," "," "," "," "," "," "," "," "," "," "," "," "," "," "]
[476," "," "," "," "," "," "," "," "," "," "," "," "," "," "," "," "," "," "," "]
[477," "," "," "," "," "," "," "," "," "," "," "," "," "," "," "," "," "," "," "]
[478," "," "," "," "," "," "," "," "," "," "," "," "," "," "," "," "," "," "," "]
[479," "," "," "," "," "," "," "," "," "," "," "," "," "," "," "," "," "," "," "]
[480," "," "," "," "," "," "," "," "," "," "," "," "," "," "," "," "," "," "," "]
[481," "," "," "," "," "," "," "," "," "," "," "," "," "," "," "," "," "," "," "]
[482," "," "," "," "," "," "," "," "," "," "," "," "," "," "," "," "," "," "," "]
[483," "," "," "," "," "," "," "," "," "," "," "," "," "," "," "," "," "," "," "]
[484," "," "," "," "," "," "," "," "," "," "," "," "," "," "," "," "," "," "," "]
[485," "," "," "," "," "," "," "," "," "," "," "," "," "," "," "," "," "," "," "]
[486," "," "," "," "," "," "," "," "," "," "," "," "," "," "," "," "," "," "," "]
[487," "," "," "," "," "," "," "," "," "," "," "," "," "," "," "," "," "," "," "]
[488," "," "," "," "," "," "," "," "," "," "," "," "," "," "," "," "," "," "," "]
[489," "," "," "," "," "," "," "," "," "," "," "," "," "," "," "," "," "," "," "]
[490," "," "," "," "," "," "," "," "," "," "," "," "," "," "," "," "," "," "," "]
[491," "," "," "," "," "," "," "," "," "," "," "," "," "," "," "," "," "," "," "]
[492," "," "," "," "," "," "," "," "," "," "," "," "," "," "," "," "," "," "," "]
[493," "," "," "," "," "," "," "," "," "," "," "," "," "," "," "," "," "," "," "]
[494," "," "," "," "," "," "," "," "," "," "," "," "," "," "," "," "," "," "," "]
[495," "," "," "," "," "," "," "," "," "," "," "," "," "," "," "," "," "," "," "]
[496," "," "," "," "," "," "," "," "," "," "," "," "," "," "," "," "," "," "," "]
[497," "," "," "," "," "," "," "," "," "," "," "," "," "," "," "," "," "," "," "]
[498," "," "," "," "," "," "," "," "," "," "," "," "," "," "," "," "," "," "," "]
[499," "," "," "," "," "," "," "," "," "," "," "," "," "," "," "," "," "," "," "]
[500," "," "," "," "," "," "," "," "," "," "," "," "," "," "," "," "," "," "," "]
[501," "," "," "," "," "," "," "," "," "," "," "," "," "," "," "," "," "," "," "]
[502," "," "," "," "," "," "," "," "," "," "," "," "," "," "," "," "," "," "," "]
[503," "," "," "," "," "," "," "," "," "," "," "," "," "," "," "," "," "," "," "]
[504," "," "," "," "," "," "," "," "," "," "," "," "," "," "," "," "," "," "," "]
[505," "," "," "," "," "," "," "," "," "," "," "," "," "," "," "," "," "," "," "]
[506," "," "," "," "," "," "," "," "," "," "," "," "," "," "," "," "," "," "," "]
[507," "," "," "," "," "," "," "," "," "," "," "," "," "," "," "," "," "," "," "]
[508," "," "," "," "," "," "," "," "," "," "," "," "," "," "," "," "," "," "," "]
[509," "," "," "," "," "," "," "," "," "," "," "," "," "," "," "," "," "," "," "]
[510," "," "," "," "," "," "," "," "," "," "," "," "," "," "," "," "," "," "," "]
[511," "," "," "," "," "," "," "," "," "," "," "," "," "," "," "," "," "," "," "]
[512," "," "," "," "," "," "," "," "," "," "," "," "," "," "," "," "," "," "," "]
[513," "," "," "," "," "," "," "," "," "," "," "," "," "," "," "," "," "," "," "]
[514," "," "," "," "," "," "," "," "," "," "," "," "," "," "," "," "," "," "," "]
[515," "," "," "," "," "," "," "," "," "," "," "," "," "," "," "," "," "," "," "]
[516," "," "," "," "," "," "," "," "," "," "," "," "," "," "," "," "," "," "," "]
[517," "," "," "," "," "," "," "," "," "," "," "," "," "," "," "," "," "," "," "]
[518," "," "," "," "," "," "," "," "," "," "," "," "," "," "," "," "," "," "," "]
[519," "," "," "," "," "," "," "," "," "," "," "," "," "," "," "," "," "," "," "]
[520," "," "," "," "," "," "," "," "," "," "," "," "," "," "," "," "," "," "," "]
[521," "," "," "," "," "," "," "," "," "," "," "," "," "," "," "," "," "," "," "]
[522," "," "," "," "," "," "," "," "," "," "," "," "," "," "," "," "," "," "," "]
[523," "," "," "," "," "," "," "," "," "," "," "," "," "," "," "," "," "," "," "]
[524," "," "," "," "," "," "," "," "," "," "," "," "," "," "," "," "," "," "," "]
[525," "," "," "," "," "," "," "," "," "," "," "," "," "," "," "," "," "," "," "]
[526," "," "," "," "," "," "," "," "," "," "," "," "," "," "," "," "," "," "," "]
[527," "," "," "," "," "," "," "," "," "," "," "," "," "," "," "," "," "," "," "]
[528," "," "," "," "," "," "," "," "," "," "," "," "," "," "," "," "," "," "," "]
[529," "," "," "," "," "," "," "," "," "," "," "," "," "," "," "," "," "," "," "]
[530," "," "," "," "," "," "," "," "," "," "," "," "," "," "," "," "," "," "," "]
[531," "," "," "," "," "," "," "," "," "," "," "," "," "," "," "," "," "," "," "]
[532," "," "," "," "," "," "," "," "," "," "," "," "," "," "," "," "," "," "," "]
[533," "," "," "," "," "," "," "," "," "," "," "," "," "," "," "," "," "," "," "]
[534," "," "," "," "," "," "," "," "," "," "," "," "," "," "," "," "," "," "," "]
[535," "," "," "," "," "," "," "," "," "," "," "," "," "," "," "," "," "," "," "]
[536," "," "," "," "," "," "," "," "," "," "," "," "," "," "," "," "," "," "," "]
[537," "," "," "," "," "," "," "," "," "," "," "," "," "," "," "," "," "," "," "]
[538," "," "," "," "," "," "," "," "," "," "," "," "," "," "," "," "," "," "," "]
[539," "," "," "," "," "," "," "," "," "," "," "," "," "," "," "," "," "," "," "]
[540," "," "," "," "," "," "," "," "," "," "," "," "," "," "," "," "," "," "," "]
[541," "," "," "," "," "," "," "," "," "," "," "," "," "," "," "," "," "," "," "]
[542," "," "," "," "," "," "," "," "," "," "," "," "," "," "," "," "," "," "," "]
[543," "," "," "," "," "," "," "," "," "," "," "," "," "," "," "," "," "," "," "]
[544," "," "," "," "," "," "," "," "," "," "," "," "," "," "," "," "," "," "," "]
[545," "," "," "," "," "," "," "," "," "," "," "," "," "," "," "," "," "," "," "]
[546," "," "," "," "," "," "," "," "," "," "," "," "," "," "," "," "," "," "," "]
[547," "," "," "," "," "," "," "," "," "," "," "," "," "," "," "," "," "," "," "]
[548," "," "," "," "," "," "," "," "," "," "," "," "," "," "," "," "," "," "," "]
[549," "," "," "," "," "," "," "," "," "," "," "," "," "," "," "," "," "," "," "]
[550," "," "," "," "," "," "," "," "," "," "," "," "," "," "," "," "," "," "," "]
[551," "," "," "," "," "," "," "," "," "," "," "," "," "," "," "," "," "," "," "]
[552," "," "," "," "," "," "," "," "," "," "," "," "," "," "," "," "," "," "," "]
[553," "," "," "," "," "," "," "," "," "," "," "," "," "," "," "," "," "," "," "]
[554," "," "," "," "," "," "," "," "," "," "," "," "," "," "," "," "," "," "," "]
[555," "," "," "," "," "," "," "," "," "," "," "," "," "," "," "," "," "," "," "]
[556," "," "," "," "," "," "," "," "," "," "," "," "," "," "," "," "," "," "," "]
[557," "," "," "," "," "," "," "," "," "," "," "," "," "," "," "," "," "," "," "]
[558," "," "," "," "," "," "," "," "," "," "," "," "," "," "," "," "," "," "," "]
[559," "," "," "," "," "," "," "," "," "," "," "," "," "," "," "," "," "," "," "]
[560," "," "," "," "," "," "," "," "," "," "," "," "," "," "," "," "," "," "," "]
[561," "," "," "," "," "," "," "," "," "," "," "," "," "," "," "," "," "," "," "]
[562," "," "," "," "," "," "," "," "," "," "," "," "," "," "," "," "," "," "," "]
[563," "," "," "," "," "," "," "," "," "," "," "," "," "," "," "," "," "," "," "]
[564," "," "," "," "," "," "," "," "," "," "," "," "," "," "," "," "," "," "," "]
[565," "," "," "," "," "," "," "," "," "," "," "," "," "," "," "," "," "," "," "]
[566," "," "," "," "," "," "," "," "," "," "," "," "," "," "," "," "," "," "," "]
[567," "," "," "," "," "," "," "," "," "," "," "," "," "," "," "," "," "," "," "]
[568," "," "," "," "," "," "," "," "," "," "," "," "," "," "," "," "," "," "," "]
[569," "," "," "," "," "," "," "," "," "," "," "," "," "," "," "," "," "," "," "]
[570," "," "," "," "," "," "," "," "," "," "," "," "," "," "," "," "," "," "," "]
[571," "," "," "," "," "," "," "," "," "," "," "," "," "," "," "," "," "," "," "]
[572," "," "," "," "," "," "," "," "," "," "," "," "," "," "," "," "," "," "," "]
[573," "," "," "," "," "," "," "," "," "," "," "," "," "," "," "," "," "," "," "]
[574," "," "," "," "," "," "," "," "," "," "," "," "," "," "," "," "," "," "," "]
[575," "," "," "," "," "," "," "," "," "," "," "," "," "," "," "," "," "," "," "]
[576," "," "," "," "," "," "," "," "," "," "," "," "," "," "," "," "," "," "," "]
[577," "," "," "," "," "," "," "," "," "," "," "," "," "," "," "," "," "," "," "]
[578," "," "," "," "," "," "," "," "," "," "," "," "," "," "," "," "," "," "," "]
[579," "," "," "," "," "," "," "," "," "," "," "," "," "," "," "," "," "," "," "]
[580," "," "," "," "," "," "," "," "," "," "," "," "," "," "," "," "," "," "," "]
[581," "," "," "," "," "," "," "," "," "," "," "," "," "," "," "," "," "," "," "]
[582," "," "," "," "," "," "," "," "," "," "," "," "," "," "," "," "," "," "," "]
[583," "," "," "," "," "," "," "," "," "," "," "," "," "," "," "," "," "," "," "]
[584," "," "," "," "," "," "," "," "," "," "," "," "," "," "," "," "," "," "," "]
[585," "," "," "," "," "," "," "," "," "," "," "," "," "," "," "," "," "," "," "]
[586," "," "," "," "," "," "," "," "," "," "," "," "," "," "," "," "," "," "," "]
[587," "," "," "," "," "," "," "," "," "," "," "," "," "," "," "," "," "," "," "]
[588," "," "," "," "," "," "," "," "," "," "," "," "," "," "," "," "," "," "," "]
[589," "," "," "," "," "," "," "," "," "," "," "," "," "," "," "," "," "," "," "]
[590," "," "," "," "," "," "," "," "," "," "," "," "," "," "," "," "," "," "," "]
[591," "," "," "," "," "," "," "," "," "," "," "," "," "," "," "," "," "," "," "]
[592," "," "," "," "," "," "," "," "," "," "," "," "," "," "," "," "," "," "," "]
[593," "," "," "," "," "," "," "," "," "," "," "," "," "," "," "," "," "," "," "]
[594," "," "," "," "," "," "," "," "," "," "," "," "," "," "," "," "," "," "," "]
[595," "," "," "," "," "," "," "," "," "," "," "," "," "," "," "," "," "," "," "]
[596," "," "," "," "," "," "," "," "," "," "," "," "," "," "," "," "," "," "," "]
[597," "," "," "," "," "," "," "," "," "," "," "," "," "," "," "," "," "," "," "]
[598," "," "," "," "," "," "," "," "," "," "," "," "," "," "," "," "," "," "," "]
[599," "," "," "," "," "," "," "," "," "," "," "," "," "," "," "," "," "," "," "]
[600," "," "," "," "," "," "," "," "," "," "," "," "," "," "," "," "," "," "," "]
[601," "," "," "," "," "," "," "," "," "," "," "," "," "," "," "," "," "," "," "]
[602," "," "," "," "," "," "," "," "," "," "," "," "," "," "," "," "," "," "," "]
[603," "," "," "," "," "," "," "," "," "," "," "," "," "," "," "," "," "," "," "]
[604," "," "," "," "," "," "," "," "," "," "," "," "," "," "," "," "," "," "," "]
[605," "," "," "," "," "," "," "," "," "," "," "," "," "," "," "," "," "," "," "]
[606," "," "," "," "," "," "," "," "," "," "," "," "," "," "," "," "," "," "," "]
[607," "," "," "," "," "," "," "," "," "," "," "," "," "," "," "," "," "," "," "]
[608," "," "," "," "," "," "," "," "," "," "," "," "," "," "," "," "," "," "," "]
[609," "," "," "," "," "," "," "," "," "," "," "," "," "," "," "," "," "," "," "]
[610," "," "," "," "," "," "," "," "," "," "," "," "," "," "," "," "," "," "," "]
[611," "," "," "," "," "," "," "," "," "," "," "," "," "," "," "," "," "," "," "]
[612," "," "," "," "," "," "," "," "," "," "," "," "," "," "," "," "," "," "," "]
[613," "," "," "," "," "," "," "," "," "," "," "," "," "," "," "," "," "," "," "]
[614," "," "," "," "," "," "," "," "," "," "," "," "," "," "," "," "," "," "," "]
[615," "," "," "," "," "," "," "," "," "," "," "," "," "," "," "," "," "," "," "]
[616," "," "," "," "," "," "," "," "," "," "," "," "," "," "," "," "," "," "," "]
[617," "," "," "," "," "," "," "," "," "," "," "," "," "," "," "," "," "," "," "]
[618," "," "," "," "," "," "," "," "," "," "," "," "," "," "," "," "," "," "," "]
[619," "," "," "," "," "," "," "," "," "," "," "," "," "," "," "," "," "," "," "]
[620," "," "," "," "," "," "," "," "," "," "," "," "," "," "," "," "," "," "," "]
[621," "," "," "," "," "," "," "," "," "," "," "," "," "," "," "," "," "," "," "]
[622," "," "," "," "," "," "," "," "," "," "," "," "," "," "," "," "," "," "," "]
[623," "," "," "," "," "," "," "," "," "," "," "," "," "," "," "," "," "," "," "]
[624," "," "," "," "," "," "," "," "," "," "," "," "," "," "," "," "," "," "," "]
[625," "," "," "," "," "," "," "," "," "," "," "," "," "," "," "," "," "," "," "]
[626," "," "," "," "," "," "," "," "," "," "," "," "," "," "," "," "," "," "," "]
[627," "," "," "," "," "," "," "," "," "," "," "," "," "," "," "," "," "," "," "]
[628," "," "," "," "," "," "," "," "," "," "," "," "," "," "," "," "," "," "," "]
[629," "," "," "," "," "," "," "," "," "," "," "," "," "," "," "," "," "," "," "]
[630," "," "," "," "," "," "," "," "," "," "," "," "," "," "," "," "," "," "," "]
[631," "," "," "," "," "," "," "," "," "," "," "," "," "," "," "," "," "," "," "]
[632," "," "," "," "," "," "," "," "," "," "," "," "," "," "," "," "," "," "," "]
[633," "," "," "," "," "," "," "," "," "," "," "," "," "," "," "," "," "," "," "]
[634," "," "," "," "," "," "," "," "," "," "," "," "," "," "," "," "," "," "," "]
[635," "," "," "," "," "," "," "," "," "," "," "," "," "," "," "," "," "," "," "]
[636," "," "," "," "," "," "," "," "," "," "," "," "," "," "," "," "," "," "," "]
[637," "," "," "," "," "," "," "," "," "," "," "," "," "," "," "," "," "," "," "]
[638," "," "," "," "," "," "," "," "," "," "," "," "," "," "," "," "," "," "," "]
[639," "," "," "," "," "," "," "," "," "," "," "," "," "," "," "," "," "," "," "]
[640," "," "," "," "," "," "," "," "," "," "," "," "," "," "," "," "," "," "," "]
[641," "," "," "," "," "," "," "," "," "," "," "," "," "," "," "," "," "," "," "]
[642," "," "," "," "," "," "," "," "," "," "," "," "," "," "," "," "," "," "," "]
[643," "," "," "," "," "," "," "," "," "," "," "," "," "," "," "," "," "," "," "]
[644," "," "," "," "," "," "," "," "," "," "," "," "," "," "," "," "," "," "," "]
[645," "," "," "," "," "," "," "," "," "," "," "," "," "," "," "," "," "," "," "]
[646," "," "," "," "," "," "," "," "," "," "," "," "," "," "," "," "," "," "," "]
[647," "," "," "," "," "," "," "," "," "," "," "," "," "," "," "," "," "," "," "]
[648," "," "," "," "," "," "," "," "," "," "," "," "," "," "," "," "," "," "," "]
[649," "," "," "," "," "," "," "," "," "," "," "," "," "," "," "," "," "," "," "]
[650," "," "," "," "," "," "," "," "," "," "," "," "," "," "," "," "," "," "," "]
[651," "," "," "," "," "," "," "," "," "," "," "," "," "," "," "," "," "," "," "]
[652," "," "," "," "," "," "," "," "," "," "," "," "," "," "," "," "," "," "," "]
[653," "," "," "," "," "," "," "," "," "," "," "," "," "," "," "," "," "," "," "]
[654," "," "," "," "," "," "," "," "," "," "," "," "," "," "," "," "," "," "," "]
[655," "," "," "," "," "," "," "," "," "," "," "," "," "," "," "," "," "," "," "]
[656," "," "," "," "," "," "," "," "," "," "," "," "," "," "," "," "," "," "," "]
[657," "," "," "," "," "," "," "," "," "," "," "," "," "," "," "," "," "," "," "]
[658," "," "," "," "," "," "," "," "," "," "," "," "," "," "," "," "," "," "," "]
[659," "," "," "," "," "," "," "," "," "," "," "," "," "," "," "," "," "," "," "]
[660," "," "," "," "," "," "," "," "," "," "," "," "," "," "," "," "," "," "," "]
[661," "," "," "," "," "," "," "," "," "," "," "," "," "," "," "," "," "," "," "]
[662," "," "," "," "," "," "," "," "," "," "," "," "," "," "," "," "," "," "," "]
[663," "," "," "," "," "," "," "," "," "," "," "," "," "," "," "," "," "," "," "]
[664," "," "," "," "," "," "," "," "," "," "," "," "," "," "," "," "," "," "," "]
[665," "," "," "," "," "," "," "," "," "," "," "," "," "," "," "," "," "," "," "]
[666," "," "," "," "," "," "," "," "," "," "," "," "," "," "," "," "," "," "," "]
[667," "," "," "," "," "," "," "," "," "," "," "," "," "," "," "," "," "," "," "]
[668," "," "," "," "," "," "," "," "," "," "," "," "," "," "," "," "," "," "," "]
[669," "," "," "," "," "," "," "," "," "," "," "," "," "," "," "," "," "," "," "]
[670," "," "," "," "," "," "," "," "," "," "," "," "," "," "," "," "," "," "," "]
[671," "," "," "," "," "," "," "," "," "," "," "," "," "," "," "," "," "," "," "]
[672," "," "," "," "," "," "," "," "," "," "," "," "," "," "," "," "," "," "," "]
[673," "," "," "," "," "," "," "," "," "," "," "," "," "," "," "," "," "," "," "]
[674," "," "," "," "," "," "," "," "," "," "," "," "," "," "," "," "," "," "," "]
[675," "," "," "," "," "," "," "," "," "," "," "," "," "," "," "," "," "," "," "]
[676," "," "," "," "," "," "," "," "," "," "," "," "," "," "," "," "," "," "," "]
[677," "," "," "," "," "," "," "," "," "," "," "," "," "," "," "," "," "," "," "]
[678," "," "," "," "," "," "," "," "," "," "," "," "," "," "," "," "," "," "," "]
[679," "," "," "," "," "," "," "," "," "," "," "," "," "," "," "," "," "," "," "]
[680," "," "," "," "," "," "," "," "," "," "," "," "," "," "," "," "," "," "," "]
[681," "," "," "," "," "," "," "," "," "," "," "," "," "," "," "," "," "," "," "]
[682," "," "," "," "," "," "," "," "," "," "," "," "," "," "," "," "," "," "," "]
[683," "," "," "," "," "," "," "," "," "," "," "," "," "," "," "," "," "," "," "]
[684," "," "," "," "," "," "," "," "," "," "," "," "," "," "," "," "," "," "," "]
[685," "," "," "," "," "," "," "," "," "," "," "," "," "," "," "," "," "," "," "]
[686," "," "," "," "," "," "," "," "," "," "," "," "," "," "," "," "," "," "," "]
[687," "," "," "," "," "," "," "," "," "," "," "," "," "," "," "," "," "," "," "]
[688," "," "," "," "," "," "," "," "," "," "," "," "," "," "," "," "," "," "," "]
[689," "," "," "," "," "," "," "," "," "," "," "," "," "," "," "," "," "," "," "]
[690," "," "," "," "," "," "," "," "," "," "," "," "," "," "," "," "," "," "," "]
[691," "," "," "," "," "," "," "," "," "," "," "," "," "," "," "," "," "," "," "]
[692," "," "," "," "," "," "," "," "," "," "," "," "," "," "," "," "," "," "," "]
[693," "," "," "," "," "," "," "," "," "," "," "," "," "," "," "," "," "," "," "]
[694," "," "," "," "," "," "," "," "," "," "," "," "," "," "," "," "," "," "," "]
[695," "," "," "," "," "," "," "," "," "," "," "," "," "," "," "," "," "," "," "]
[696," "," "," "," "," "," "," "," "," "," "," "," "," "," "," "," "," "," "," "]
[697," "," "," "," "," "," "," "," "," "," "," "," "," "," "," "," "," "," "," "]
[698," "," "," "," "," "," "," "," "," "," "," "," "," "," "," "," "," "," "," "]
[699," "," "," "," "," "," "," "," "," "," "," "," "," "," "," "," "," "," "," "]
[700," "," "," "," "," "," "," "," "," "," "," "," "," "," "," "," "," "," "," "]
[701," "," "," "," "," "," "," "," "," "," "," "," "," "," "," "," "," "," "," "]
[702," "," "," "," "," "," "," "," "," "," "," "," "," "," "," "," "," "," "," "]
[703," "," "," "," "," "," "," "," "," "," "," "," "," "," "," "," "," "," "," "]
[704," "," "," "," "," "," "," "," "," "," "," "," "," "," "," "," "," "," "," "]
[705," "," "," "," "," "," "," "," "," "," "," "," "," "," "," "," "," "," "," "]
[706," "," "," "," "," "," "," "," "," "," "," "," "," "," "," "," "," "," "," "]
[707," "," "," "," "," "," "," "," "," "," "," "," "," "," "," "," "," "," "," "]
[708," "," "," "," "," "," "," "," "," "," "," "," "," "," "," "," "," "," "," "]
[709," "," "," "," "," "," "," "," "," "," "," "," "," "," "," "," "," "," "," "]
[710," "," "," "," "," "," "," "," "," "," "," "," "," "," "," "," "," "," "," "]
[711," "," "," "," "," "," "," "," "," "," "," "," "," "," "," "," "," "," "," "]
[712," "," "," "," "," "," "," "," "," "," "," "," "," "," "," "," "," "," "," "]
[713," "," "," "," "," "," "," "," "," "," "," "," "," "," "," "," "," "," "," "]
[714," "," "," "," "," "," "," "," "," "," "," "," "," "," "," "," "," "," "," "]
[715," "," "," "," "," "," "," "," "," "," "," "," "," "," "," "," "," "," "," "]
[716," "," "," "," "," "," "," "," "," "," "," "," "," "," "," "," "," "," "," "]
[717," "," "," "," "," "," "," "," "," "," "," "," "," "," "," "," "," "," "," "]
[718," "," "," "," "," "," "," "," "," "," "," "," "," "," "," "," "," "," "," "]
[719," "," "," "," "," "," "," "," "," "," "," "," "," "," "," "," "," "," "," "]
[720," "," "," "," "," "," "," "," "," "," "," "," "," "," "," "," "," "," "," "]
[721," "," "," "," "," "," "," "," "," "," "," "," "," "," "," "," "," "," "," "]
[722," "," "," "," "," "," "," "," "," "," "," "," "," "," "," "," "," "," "," "]
[723," "," "," "," "," "," "," "," "," "," "," "," "," "," "," "," "," "," "," "]
[724," "," "," "," "," "," "," "," "," "," "," "," "," "," "," "," "," "," "," "]
[725," "," "," "," "," "," "," "," "," "," "," "," "," "," "," "," "," "," "," "]
[726," "," "," "," "," "," "," "," "," "," "," "," "," "," "," "," "," "," "," "]
[727," "," "," "," "," "," "," "," "," "," "," "," "," "," "," "," "," "," "," "]
[728," "," "," "," "," "," "," "," "," "," "," "," "," "," "," "," "," "," "," "]
[729," "," "," "," "," "," "," "," "," "," "," "," "," "," "," "," "," "," "," "]
[730," "," "," "," "," "," "," "," "," "," "," "," "," "," "," "," "," "," "," "]
[731," "," "," "," "," "," "," "," "," "," "," "," "," "," "," "," "," "," "," "]
[732," "," "," "," "," "," "," "," "," "," "," "," "," "," "," "," "," "," "," "]
[733," "," "," "," "," "," "," "," "," "," "," "," "," "," "," "," "," "," "," "]
[734," "," "," "," "," "," "," "," "," "," "," "," "," "," "," "," "," "," "," "]
[735," "," "," "," "," "," "," "," "," "," "," "," "," "," "," "," "," "," "," "]
[736," "," "," "," "," "," "," "," "," "," "," "," "," "," "," "," "," "," "," "]
[737," "," "," "," "," "," "," "," "," "," "," "," "," "," "," "," "," "," "," "]
[738," "," "," "," "," "," "," "," "," "," "," "," "," "," "," "," "," "," "," "]
[739," "," "," "," "," "," "," "," "," "," "," "," "," "," "," "," "," "," "," "]
[740," "," "," "," "," "," "," "," "," "," "," "," "," "," "," "," "," "," "," "]
[741," "," "," "," "," "," "," "," "," "," "," "," "," "," "," "," "," "," "," "]
[742," "," "," "," "," "," "," "," "," "," "," "," "," "," "," "," "," "," "," "]
[743," "," "," "," "," "," "," "," "," "," "," "," "," "," "," "," "," "," "," "]
[744," "," "," "," "," "," "," "," "," "," "," "," "," "," "," "," "," "," "," "]
[745," "," "," "," "," "," "," "," "," "," "," "," "," "," "," "," "," "," "," "]
[746," "," "," "," "," "," "," "," "," "," "," "," "," "," "," "," "," "," "," "]
[747," "," "," "," "," "," "," "," "," "," "," "," "," "," "," "," "," "," "," "]
[748," "," "," "," "," "," "," "," "," "," "," "," "," "," "," "," "," "," "," "]
[749," "," "," "," "," "," "," "," "," "," "," "," "," "," "," "," "," "," "," "]
[750," "," "," "," "," "," "," "," "," "," "," "," "," "," "," "," "," "," "," "]
[751," "," "," "," "," "," "," "," "," "," "," "," "," "," "," "," "," "," "," "]
[752," "," "," "," "," "," "," "," "," "," "," "," "," "," "," "," "," "," "," "]
[753," "," "," "," "," "," "," "," "," "," "," "," "," "," "," "," "," "," "," "]
[754," "," "," "," "," "," "," "," "," "," "," "," "," "," "," "," "," "," "," "]
[755," "," "," "," "," "," "," "," "," "," "," "," "," "," "," "," "," "," "," "]
[756," "," "," "," "," "," "," "," "," "," "," "," "," "," "," "," "," "," "," "]
[757," "," "," "," "," "," "," "," "," "," "," "," "," "," "," "," "," "," "," "]
[758," "," "," "," "," "," "," "," "," "," "," "," "," "," "," "," "," "," "," "]
[759," "," "," "," "," "," "," "," "," "," "," "," "," "," "," "," "," "," "," "]
[760," "," "," "," "," "," "," "," "," "," "," "," "," "," "," "," "," "," "," "]
[761," "," "," "," "," "," "," "," "," "," "," "," "," "," "," "," "," "," "," "]
[762," "," "," "," "," "," "," "," "," "," "," "," "," "," "," "," "," "," "," "]
[763," "," "," "," "," "," "," "," "," "," "," "," "," "," "," "," "," "," "," "]
[764," "," "," "," "," "," "," "," "," "," "," "," "," "," "," "," "," "," "," "]
[765," "," "," "," "," "," "," "," "," "," "," "," "," "," "," "," "," "," "," "]
[766," "," "," "," "," "," "," "," "," "," "," "," "," "," "," "," "," "," "," "]
[767," "," "," "," "," "," "," "," "," "," "," "," "," "," "," "," "," "," "," "]
[768," "," "," "," "," "," "," "," "," "," "," "," "," "," "," "," "," "," "," "]
[769," "," "," "," "," "," "," "," "," "," "," "," "," "," "," "," "," "," "," "]
[770," "," "," "," "," "," "," "," "," "," "," "," "," "," "," "," "," "," "," "]
[771," "," "," "," "," "," "," "," "," "," "," "," "," "," "," "," "," "," "," "]
[772," "," "," "," "," "," "," "," "," "," "," "," "," "," "," "," "," "," "," "]
[773," "," "," "," "," "," "," "," "," "," "," "," "," "," "," "," "," "," "," "]
[774," "," "," "," "," "," "," "," "," "," "," "," "," "," "," "," "," "," "," "]
[775," "," "," "," "," "," "," "," "," "," "," "," "," "," "," "," "," "," "," "]
[776," "," "," "," "," "," "," "," "," "," "," "," "," "," "," "," "," "," "," "]
[777," "," "," "," "," "," "," "," "," "," "," "," "," "," "," "," "," "," "," "]
[778," "," "," "," "," "," "," "," "," "," "," "," "," "," "," "," "," "," "," "]
[779," "," "," "," "," "," "," "," "," "," "," "," "," "," "," "," "," "," "," "]
[780," "," "," "," "," "," "," "," "," "," "," "," "," "," "," "," "," "," "," "]
[781," "," "," "," "," "," "," "," "," "," "," "," "," "," "," "," "," "," "," "]
[782," "," "," "," "," "," "," "," "," "," "," "," "," "," "," "," "," "," "," "]
[783," "," "," "," "," "," "," "," "," "," "," "," "," "," "," "," "," "," "," "]
[784," "," "," "," "," "," "," "," "," "," "," "," "," "," "," "," "," "," "," "]
[785," "," "," "," "," "," "," "," "," "," "," "," "," "," "," "," "," "," "," "]
[786," "," "," "," "," "," "," "," "," "," "," "," "," "," "," "," "," "," "," "]
[787," "," "," "," "," "," "," "," "," "," "," "," "," "," "," "," "," "," "," "]
[788," "," "," "," "," "," "," "," "," "," "," "," "," "," "," "," "," "," "," "]
[789," "," "," "," "," "," "," "," "," "," "," "," "," "," "," "," "," "," "," "]
[790," "," "," "," "," "," "," "," "," "," "," "," "," "," "," "," "," "," "," "]
[791," "," "," "," "," "," "," "," "," "," "," "," "," "," "," "," "," "," "," "]
[792," "," "," "," "," "," "," "," "," "," "," "," "," "," "," "," "," "," "," "]
[793," "," "," "," "," "," "," "," "," "," "," "," "," "," "," "," "," "," "," "]
[794," "," "," "," "," "," "," "," "," "," "," "," "," "," "," "," "," "," "," "]
[795," "," "," "," "," "," "," "," "," "," "," "," "," "," "," "," "," "," "," "]
[796," "," "," "," "," "," "," "," "," "," "," "," "," "," "," "," "," "," "," "]
[797," "," "," "," "," "," "," "," "," "," "," "," "," "," "," "," "," "," "," "]
[798," "," "," "," "," "," "," "," "," "," "," "," "," "," "," "," "," "," "," "]
[799," "," "," "," "," "," "," "," "," "," "," "," "," "," "," "," "," "," "," "]
[800," "," "," "," "," "," "," "," "," "," "," "," "," "," "," "," "," "," "," "]
[801," "," "," "," "," "," "," "," "," "," "," "," "," "," "," "," "," "," "," "]
[802," "," "," "," "," "," "," "," "," "," "," "," "," "," "," "," "," "," "," "]
[803," "," "," "," "," "," "," "," "," "," "," "," "," "," "," "," "," "," "," "]
[804," "," "," "," "," "," "," "," "," "," "," "," "," "," "," "," "," "," "," "]
[805," "," "," "," "," "," "," "," "," "," "," "," "," "," "," "," "," "," "," "]
[806," "," "," "," "," "," "," "," "," "," "," "," "," "," "," "," "," "," "," "]
[807," "," "," "," "," "," "," "," "," "," "," "," "," "," "," "," "," "," "," "]
[808," "," "," "," "," "," "," "," "," "," "," "," "," "," "," "," "," "," "," "]
[809," "," "," "," "," "," "," "," "," "," "," "," "," "," "," "," "," "," "," "]
[810," "," "," "," "," "," "," "," "," "," "," "," "," "," "," "," "," "," "," "]
[811," "," "," "," "," "," "," "," "," "," "," "," "," "," "," "," "," "," "," "]
[812," "," "," "," "," "," "," "," "," "," "," "," "," "," "," "," "," "," "," "]
[813," "," "," "," "," "," "," "," "," "," "," "," "," "," "," "," "," "," "," "]
[814," "," "," "," "," "," "," "," "," "," "," "," "," "," "," "," "," "," "," "]
[815," "," "," "," "," "," "," "," "," "," "," "," "," "," "," "," "," "," "," "]
[816," "," "," "," "," "," "," "," "," "," "," "," "," "," "," "," "," "," "," "]
[817," "," "," "," "," "," "," "," "," "," "," "," "," "," "," "," "," "," "," "]
[818," "," "," "," "," "," "," "," "," "," "," "," "," "," "," "," "," "," "," "]
[819," "," "," "," "," "," "," "," "," "," "," "," "," "," "," "," "," "," "," "]
[820," "," "," "," "," "," "," "," "," "," "," "," "," "," "," "," "," "," "," "]
[821," "," "," "," "," "," "," "," "," "," "," "," "," "," "," "," "," "," "," "]
[822," "," "," "," "," "," "," "," "," "," "," "," "," "," "," "," "," "," "," "]
[823," "," "," "," "," "," "," "," "," "," "," "," "," "," "," "," "," "," "," "]
[824," "," "," "," "," "," "," "," "," "," "," "," "," "," "," "," "," "," "," "]
[825," "," "," "," "," "," "," "," "," "," "," "," "," "," "," "," "," "," "," "]
[826," "," "," "," "," "," "," "," "," "," "," "," "," "," "," "," "," "," "," "]
[827," "," "," "," "," "," "," "," "," "," "," "," "," "," "," "," "," "," "," "]
[828," "," "," "," "," "," "," "," "," "," "," "," "," "," "," "," "," "," "," "]
[829," "," "," "," "," "," "," "," "," "," "," "," "," "," "," "," "," "," "," "]
[830," "," "," "," "," "," "," "," "," "," "," "," "," "," "," "," "," "," "," "]
[831," "," "," "," "," "," "," "," "," "," "," "," "," "," "," "," "," "," "," "]
[832," "," "," "," "," "," "," "," "," "," "," "," "," "," "," "," "," "," "," "]
[833," "," "," "," "," "," "," "," "," "," "," "," "," "," "," "," "," "," "," "]
[834," "," "," "," "," "," "," "," "," "," "," "," "," "," "," "," "," "," "," "]
[835," "," "," "," "," "," "," "," "," "," "," "," "," "," "," "," "," "," "," "]
[836," "," "," "," "," "," "," "," "," "," "," "," "," "," "," "," "," "," "," "]
[837," "," "," "," "," "," "," "," "," "," "," "," "," "," "," "," "," "," "," "]
[838," "," "," "," "," "," "," "," "," "," "," "," "," "," "," "," "," "," "," "]
[839," "," "," "," "," "," "," "," "," "," "," "," "," "," "," "," "," "," "," "]
[840," "," "," "," "," "," "," "," "," "," "," "," "," "," "," "," "," "," "," "]
[841," "," "," "," "," "," "," "," "," "," "," "," "," "," "," "," "," "," "," "]
[842," "," "," "," "," "," "," "," "," "," "," "," "," "," "," "," "," "," "," "]
[843," "," "," "," "," "," "," "," "," "," "," "," "," "," "," "," "," "," "," "]
[844," "," "," "," "," "," "," "," "," "," "," "," "," "," "," "," "," "," "," "]
[845," "," "," "," "," "," "," "," "," "," "," "," "," "," "," "," "," "," "," "]
[846," "," "," "," "," "," "," "," "," "," "," "," "," "," "," "," "," "," "," "]
[847," "," "," "," "," "," "," "," "," "," "," "," "," "," "," "," "," "," "," "]
[848," "," "," "," "," "," "," "," "," "," "," "," "," "," "," "," "," "," "," "]
[849," "," "," "," "," "," "," "," "," "," "," "," "," "," "," "," "," "," "," "]
[850," "," "," "," "," "," "," "," "," "," "," "," "," "," "," "," "," "," "," "]
[851," "," "," "," "," "," "," "," "," "," "," "," "," "," "," "," "," "," "," "]
[852," "," "," "," "," "," "," "," "," "," "," "," "," "," "," "," "," "," "," "]
[853," "," "," "," "," "," "," "," "," "," "," "," "," "," "," "," "," "," "," "]
[854," "," "," "," "," "," "," "," "," "," "," "," "," "," "," "," "," "," "," "]
[855," "," "," "," "," "," "," "," "," "," "," "," "," "," "," "," "," "," "," "]
[856," "," "," "," "," "," "," "," "," "," "," "," "," "," "," "," "," "," "," "]
[857," "," "," "," "," "," "," "," "," "," "," "," "," "," "," "," "," "," "," "]
[858," "," "," "," "," "," "," "," "," "," "," "," "," "," "," "," "," "," "," "]
[859," "," "," "," "," "," "," "," "," "," "," "," "," "," "," "," "," "," "," "]
[860," "," "," "," "," "," "," "," "," "," "," "," "," "," "," "," "," "," "," "]
[861," "," "," "," "," "," "," "," "," "," "," "," "," "," "," "," "," "," "," "]
[862," "," "," "," "," "," "," "," "," "," "," "," "," "," "," "," "," "," "," "]
[863," "," "," "," "," "," "," "," "," "," "," "," "," "," "," "," "," "," "," "]
[864," "," "," "," "," "," "," "," "," "," "," "," "," "," "," "," "," "," "," "]
[865," "," "," "," "," "," "," "," "," "," "," "," "," "," "," "," "," "," "," "]
[866," "," "," "," "," "," "," "," "," "," "," "," "," "," "," "," "," "," "," "]
[867," "," "," "," "," "," "," "," "," "," "," "," "," "," "," "," "," "," "," "]
[868," "," "," "," "," "," "," "," "," "," "," "," "," "," "," "," "," "," "," "]
[869," "," "," "," "," "," "," "," "," "," "," "," "," "," "," "," "," "," "," "]
[870," "," "," "," "," "," "," "," "," "," "," "," "," "," "," "," "," "," "," "]
[871," "," "," "," "," "," "," "," "," "," "," "," "," "," "," "," "," "," "," "]
[872," "," "," "," "," "," "," "," "," "," "," "," "," "," "," "," "," "," "," "]
[873," "," "," "," "," "," "," "," "," "," "," "," "," "," "," "," "," "," "," "]
[874," "," "," "," "," "," "," "," "," "," "," "," "," "," "," "," "," "," "," "]
[875," "," "," "," "," "," "," "," "," "," "," "," "," "," "," "," "," "," "," "]
[876," "," "," "," "," "," "," "," "," "," "," "," "," "," "," "," "," "," "," "]
[877," "," "," "," "," "," "," "," "," "," "," "," "," "," "," "," "," "," "," "]
[878," "," "," "," "," "," "," "," "," "," "," "," "," "," "," "," "," "," "," "]
[879," "," "," "," "," "," "," "," "," "," "," "," "," "," "," "," "," "," "," "]
[880," "," "," "," "," "," "," "," "," "," "," "," "," "," "," "," "," "," "," "]
[881," "," "," "," "," "," "," "," "," "," "," "," "," "," "," "," "," "," "," "]
[882," "," "," "," "," "," "," "," "," "," "," "," "," "," "," "," "," "," "," "]
[883," "," "," "," "," "," "," "," "," "," "," "," "," "," "," "," "," "," "," "]
[884," "," "," "," "," "," "," "," "," "," "," "," "," "," "," "," "," "," "," "]
[885," "," "," "," "," "," "," "," "," "," "," "," "," "," "," "," "," "," "," "]
[886," "," "," "," "," "," "," "," "," "," "," "," "," "," "," "," "," "," "," "]
[887," "," "," "," "," "," "," "," "," "," "," "," "," "," "," "," "," "," "," "]
[888," "," "," "," "," "," "," "," "," "," "," "," "," "," "," "," "," "," "," "]
[889," "," "," "," "," "," "," "," "," "," "," "," "," "," "," "," "," "," "," "]
[890," "," "," "," "," "," "," "," "," "," "," "," "," "," "," "," "," "," "," "]
[891," "," "," "," "," "," "," "," "," "," "," "," "," "," "," "," "," "," "," "]
[892," "," "," "," "," "," "," "," "," "," "," "," "," "," "," "," "," "," "," "]
[893," "," "," "," "," "," "," "," "," "," "," "," "," "," "," "," "," "," "," "]
[894," "," "," "," "," "," "," "," "," "," "," "," "," "," "," "," "," "," "," "]
[895," "," "," "," "," "," "," "," "," "," "," "," "," "," "," "," "," "," "," "]
[896," "," "," "," "," "," "," "," "," "," "," "," "," "," "," "," "," "," "," "]
[897," "," "," "," "," "," "," "," "," "," "," "," "," "," "," "," "," "," "," "]
[898," "," "," "," "," "," "," "," "," "," "," "," "," "," "," "," "," "," "," "]
[899," "," "," "," "," "," "," "," "," "," "," "," "," "," "," "," "," "," "," "]
[900," "," "," "," "," "," "," "," "," "," "," "," "," "," "," "," "," "," "," "]
[901," "," "," "," "," "," "," "," "," "," "," "," "," "," "," "," "," "," "," "]
[902," "," "," "," "," "," "," "," "," "," "," "," "," "," "," "," "," "," "," "]
[903," "," "," "," "," "," "," "," "," "," "," "," "," "," "," "," "," "," "," "]
[904," "," "," "," "," "," "," "," "," "," "," "," "," "," "," "," "," "," "," "]
[905," "," "," "," "," "," "," "," "," "," "," "," "," "," "," "," "," "," "," "]
[906," "," "," "," "," "," "," "," "," "," "," "," "," "," "," "," "," "," "," "]
[907," "," "," "," "," "," "," "," "," "," "," "," "," "," "," "," "," "," "," "]
[908," "," "," "," "," "," "," "," "," "," "," "," "," "," "," "," "," "," "," "]
[909," "," "," "," "," "," "," "," "," "," "," "," "," "," "," "," "," "," "," "]
[910," "," "," "," "," "," "," "," "," "," "," "," "," "," "," "," "," "," "," "]
[911," "," "," "," "," "," "," "," "," "," "," "," "," "," "," "," "," "," "," "]
[912," "," "," "," "," "," "," "," "," "," "," "," "," "," "," "," "," "," "," "]
[913," "," "," "," "," "," "," "," "," "," "," "," "," "," "," "," "," "," "," "]
[914," "," "," "," "," "," "," "," "," "," "," "," "," "," "," "," "," "," "," "]
[915," "," "," "," "," "," "," "," "," "," "," "," "," "," "," "," "," "," "," "]
[916," "," "," "," "," "," "," "," "," "," "," "," "," "," "," "," "," "," "," "]
[917," "," "," "," "," "," "," "," "," "," "," "," "," "," "," "," "," "," "," "]
[918," "," "," "," "," "," "," "," "," "," "," "," "," "," "," "," "," "," "," "]
[919," "," "," "," "," "," "," "," "," "," "," "," "," "," "," "," "," "," "," "]
[920," "," "," "," "," "," "," "," "," "," "," "," "," "," "," "," "," "," "," "]
[921," "," "," "," "," "," "," "," "," "," "," "," "," "," "," "," "," "," "," "]
[922," "," "," "," "," "," "," "," "," "," "," "," "," "," "," "," "," "," "," "]
[923," "," "," "," "," "," "," "," "," "," "," "," "," "," "," "," "," "," "," "]
[924," "," "," "," "," "," "," "," "," "," "," "," "," "," "," "," "," "," "," "]
[925," "," "," "," "," "," "," "," "," "," "," "," "," "," "," "," "," "," "," "]
[926," "," "," "," "," "," "," "," "," "," "," "," "," "," "," "," "," "," "," "]
[927," "," "," "," "," "," "," "," "," "," "," "," "," "," "," "," "," "," "," "]
[928," "," "," "," "," "," "," "," "," "," "," "," "," "," "," "," "," "," "," "]
[929," "," "," "," "," "," "," "," "," "," "," "," "," "," "," "," "," "," "," "]
[930," "," "," "," "," "," "," "," "," "," "," "," "," "," "," "," "," "," "," "]
[931," "," "," "," "," "," "," "," "," "," "," "," "," "," "," "," "," "," "," "]
[932," "," "," "," "," "," "," "," "," "," "," "," "," "," "," "," "," "," "," "]
[933," "," "," "," "," "," "," "," "," "," "," "," "," "," "," "," "," "," "," "]
[934," "," "," "," "," "," "," "," "," "," "," "," "," "," "," "," "," "," "," "]
[935," "," "," "," "," "," "," "," "," "," "," "," "," "," "," "," "," "," "," "]
[936," "," "," "," "," "," "," "," "," "," "," "," "," "," "," "," "," "," "," "]
[937," "," "," "," "," "," "," "," "," "," "," "," "," "," "," "," "," "," "," "]
[938," "," "," "," "," "," "," "," "," "," "," "," "," "," "," "," "," "," "," "]
[939," "," "," "," "," "," "," "," "," "," "," "," "," "," "," "," "," "," "," "]
[940," "," "," "," "," "," "," "," "," "," "," "," "," "," "," "," "," "," "," "]
[941," "," "," "," "," "," "," "," "," "," "," "," "," "," "," "," "," "," "," "]
[942," "," "," "," "," "," "," "," "," "," "," "," "," "," "," "," "," "," "," "]
[943," "," "," "," "," "," "," "," "," "," "," "," "," "," "," "," "," "," "," "]
[944," "," "," "," "," "," "," "," "," "," "," "," "," "," "," "," "," "," "," "]
[945," "," "," "," "," "," "," "," "," "," "," "," "," "," "," "," "," "," "," "]
[946," "," "," "," "," "," "," "," "," "," "," "," "," "," "," "," "," "," "," "]
[947," "," "," "," "," "," "," "," "," "," "," "," "," "," "," "," "," "," "," "]
[948," "," "," "," "," "," "," "," "," "," "," "," "," "," "," "," "," "," "," "]
[949," "," "," "," "," "," "," "," "," "," "," "," "," "," "," "," "," "," "," "]
[950," "," "," "," "," "," "," "," "," "," "," "," "," "," "," "," "," "," "," "]
[951," "," "," "," "," "," "," "," "," "," "," "," "," "," "," "," "," "," "," "]
[952," "," "," "," "," "," "," "," "," "," "," "," "," "," "," "," "," "," "," "]
[953," "," "," "," "," "," "," "," "," "," "," "," "," "," "," "," "," "," "," "]
[954," "," "," "," "," "," "," "," "," "," "," "," "," "," "," "," "," "," "," "]
[955," "," "," "," "," "," "," "," "," "," "," "," "," "," "," "," "," "," "," "]
[956," "," "," "," "," "," "," "," "," "," "," "," "," "," "," "," "," "," "," "]
[957," "," "," "," "," "," "," "," "," "," "," "," "," "," "," "," "," "," "," "]
[958," "," "," "," "," "," "," "," "," "," "," "," "," "," "," "," "," "," "," "]
[959," "," "," "," "," "," "," "," "," "," "," "," "," "," "," "," "," "," "," "]
[960," "," "," "," "," "," "," "," "," "," "," "," "," "," "," "," "," "," "," "]
[961," "," "," "," "," "," "," "," "," "," "," "," "," "," "," "," "," "," "," "]
[962," "," "," "," "," "," "," "," "," "," "," "," "," "," "," "," "," "," "," "]
[963," "," "," "," "," "," "," "," "," "," "," "," "," "," "," "," "," "," "," "]
[964," "," "," "," "," "," "," "," "," "," "," "," "," "," "," "," "," "," "," "]
[965," "," "," "," "," "," "," "," "," "," "," "," "," "," "," "," "," "," "," "]
[966," "," "," "," "," "," "," "," "," "," "," "," "," "," "," "," "," "," "," "]
[967," "," "," "," "," "," "," "," "," "," "," "," "," "," "," "," "," "," "," "]
[968," "," "," "," "," "," "," "," "," "," "," "," "," "," "," "," "," "," "," "]
[969," "," "," "," "," "," "," "," "," "," "," "," "," "," "," "," "," "," "," "]
[970," "," "," "," "," "," "," "," "," "," "," "," "," "," "," "," "," "," "," "]
[971," "," "," "," "," "," "," "," "," "," "," "," "," "," "," "," "," "," "," "]
[972," "," "," "," "," "," "," "," "," "," "," "," "," "," "," "," "," "," "," "]
[973," "," "," "," "," "," "," "," "," "," "," "," "," "," "," "," "," "," "," "]
[974," "," "," "," "," "," "," "," "," "," "," "," "," "," "," "," "," "," "," "]
[975," "," "," "," "," "," "," "," "," "," "," "," "," "," "," "," "," "," "," "]
[976," "," "," "," "," "," "," "," "," "," "," "," "," "," "," "," "," "," "," "]
[977," "," "," "," "," "," "," "," "," "," "," "," "," "," "," "," "," "," "," "]
[978," "," "," "," "," "," "," "," "," "," "," "," "," "," "," "," "," "," "," "]
[979," "," "," "," "," "," "," "," "," "," "," "," "," "," "," "," "," "," "," "]
[980," "," "," "," "," "," "," "," "," "," "," "," "," "," "," "," "," "," "," "]
[981," "," "," "," "," "," "," "," "," "," "," "," "," "," "," "," "," "," "," "]
[982," "," "," "," "," "," "," "," "," "," "," "," "," "," "," "," "," "," "," "]
[983," "," "," "," "," "," "," "," "," "," "," "," "," "," "," "," "," "," "," "]
[984," "," "," "," "," "," "," "," "," "," "," "," "," "," "," "," "," "," "," "]
[985," "," "," "," "," "," "," "," "," "," "," "," "," "," "," "," "," "," "," "]
[986," "," "," "," "," "," "," "," "," "," "," "," "," "," "," "," "," "," "," "]
[987," "," "," "," "," "," "," "," "," "," "," "," "," "," "," "," "," "," "," "]
[988," "," "," "," "," "," "," "," "," "," "," "," "," "," "," "," "," "," "," "]
[989," "," "," "," "," "," "," "," "," "," "," "," "," "," "," "," "," "," "," "]
[990," "," "," "," "," "," "," "," "," "," "," "," "," "," "," "," "," "," "," "]
[991," "," "," "," "," "," "," "," "," "," "," "," "," "," "," "," "," "," "," "]
[992," "," "," "," "," "," "," "," "," "," "," "," "," "," "," "," "," "," "," "]
[993," "," "," "," "," "," "," "," "," "," "," "," "," "," "," "," "," "," "," "]
[994," "," "," "," "," "," "," "," "," "," "," "," "," "," "," "," "," "," "," "]
[995," "," "," "," "," "," "," "," "," "," "," "," "," "," "," "," "," "," "," "]
[996," "," "," "," "," "," "," "," "," "," "," "," "," "," "," "," "," "," "," "]
[997," "," "," "," "," "," "," "," "," "," "," "," "," "," "," "," "," "," "," "]
[998," "," "," "," "," "," "," "," "," "," "," "," "," "," "," "," "," "," "," "]
[999," "," "," "," "," "," "," "," "," "," "," "," "," "," "," "," "," "," "," "]
[1000," "," "," "," "," "," "," "," "," "," "," "," "," "," "," "," "," "," "," "]
[1001," "," "," "," "," "," "," "," "," "," "," "," "," "," "," "," "," "," "," "]
[1002," "," "," "," "," "," "," "," "," "," "," "," "," "," "," "," "," "," "," "]
[1003," "," "," "," "," "," "," "," "," "," "," "," "," "," "," "," "," "," "," "]
[1004," "," "," "," "," "," "," "," "," "," "," "," "," "," "," "," "," "," "," "]
[1005," "," "," "," "," "," "," "," "," "," "," "," "," "," "," "," "," "," "," "]
[1006," "," "," "," "," "," "," "," "," "," "," "," "," "," "," "," "," "," "," "]
[1007," "," "," "," "," "," "," "," "," "," "," "," "," "," "," "," "," "," "," "]
[1008," "," "," "," "," "," "," "," "," "," "," "," "," "," "," "," "," "," "," "]
[1009," "," "," "," "," "," "," "," "," "," "," "," "," "," "," "," "," "," "," "]
[1010," "," "," "," "," "," "," "," "," "," "," "," "," "," "," "," "," "," "," "]
[1011," "," "," "," "," "," "," "," "," "," "," "," "," "," "," "," "," "," "," "]
[1012," "," "," "," "," "," "," "," "," "," "," "," "," "," "," "," "," "," "," "]
[1013," "," "," "," "," "," "," "," "," "," "," "," "," "," "," "," "," "," "," "]
[1014," "," "," "," "," "," "," "," "," "," "," "," "," "," "," "," "," "," "," "]
[1015," "," "," "," "," "," "," "," "," "," "," "," "," "," "," "," "," "," "," "]
[1016," "," "," "," "," "," "," "," "," "," "," "," "," "," "," "," "," "," "," "]
[1017," "," "," "," "," "," "," "," "," "," "," "," "," "," "," "," "," "," "," "]
[1018," "," "," "," "," "," "," "," "," "," "," "," "," "," "," "," "," "," "," "]
[1019," "," "," "," "," "," "," "," "," "," "," "," "," "," "," "," "," "," "," "]
[1020," "," "," "," "," "," "," "," "," "," "," "," "," "," "," "," "," "," "," "]
[1021," "," "," "," "," "," "," "," "," "," "," "," "," "," "," "," "," "," "," "]
[1022," "," "," "," "," "," "," "," "," "," "," "," "," "," "," "," "," "," "," "]
[1023," "," "," "," "," "," "," "," "," "," "," "," "," "," "," "," "," "," "," "]
[1024," "," "," "," "," "," "," "," "," "," "," "," "," "," "," "," "," "," "," "]
[1025," "," "," "," "," "," "," "," "," "," "," "," "," "," "," "," "," "," "," "]
[1026," "," "," "," "," "," "," "," "," "," "," "," "," "," "," "," "," "," "," "]
[1027," "," "," "," "," "," "," "," "," "," "," "," "," "," "," "," "," "," "," "]
[1028," "," "," "," "," "," "," "," "," "," "," "," "," "," "," "," "," "," "," "]
[1029," "," "," "," "," "," "," "," "," "," "," "," "," "," "," "," "," "," "," "]
[1030," "," "," "," "," "," "," "," "," "," "," "," "," "," "," "," "," "," "," "]
[1031," "," "," "," "," "," "," "," "," "," "," "," "," "," "," "," "," "," "," "]
[1032," "," "," "," "," "," "," "," "," "," "," "," "," "," "," "," "," "," "," "]
[1033," "," "," "," "," "," "," "," "," "," "," "," "," "," "," "," "," "," "," "]
[1034," "," "," "," "," "," "," "," "," "," "," "," "," "," "," "," "," "," "," "]
[1035," "," "," "," "," "," "," "," "," "," "," "," "," "," "," "," "," "," "," "]
[1036," "," "," "," "," "," "," "," "," "," "," "," "," "," "," "," "," "," "," "]
[1037," "," "," "," "," "," "," "," "," "," "," "," "," "," "," "," "," "," "," "]
[1038," "," "," "," "," "," "," "," "," "," "," "," "," "," "," "," "," "," "," "]
[1039," "," "," "," "," "," "," "," "," "," "," "," "," "," "," "," "," "," "," "]
[1040," "," "," "," "," "," "," "," "," "," "," "," "," "," "," "," "," "," "," "]
[1041," "," "," "," "," "," "," "," "," "," "," "," "," "," "," "," "," "," "," "]
[1042," "," "," "," "," "," "," "," "," "," "," "," "," "," "," "," "," "," "," "]
[1043," "," "," "," "," "," "," "," "," "," "," "," "," "," "," "," "," "," "," "]
[1044," "," "," "," "," "," "," "," "," "," "," "," "," "," "," "," "," "," "," "]
[1045," "," "," "," "," "," "," "," "," "," "," "," "," "," "," "," "," "," "," "]
[1046," "," "," "," "," "," "," "," "," "," "," "," "," "," "," "," "," "," "," "]
[1047," "," "," "," "," "," "," "," "," "," "," "," "," "," "," "," "," "," "," "]
[1048," "," "," "," "," "," "," "," "," "," "," "," "," "," "," "," "," "," "," "]
[1049," "," "," "," "," "," "," "," "," "," "," "," "," "," "," "," "," "," "," "]
[1050," "," "," "," "," "," "," "," "," "," "," "," "," "," "," "," "," "," "," "]
[1051," "," "," "," "," "," "," "," "," "," "," "," "," "," "," "," "," "," "," "]
[1052," "," "," "," "," "," "," "," "," "," "," "," "," "," "," "," "," "," "," "]
[1053," "," "," "," "," "," "," "," "," "," "," "," "," "," "," "," "," "," "," "]
[1054," "," "," "," "," "," "," "," "," "," "," "," "," "," "," "," "," "," "," "]
[1055," "," "," "," "," "," "," "," "," "," "," "," "," "," "," "," "," "," "," "]
[1056," "," "," "," "," "," "," "," "," "," "," "," "," "," "," "," "," "," "," "]
[1057," "," "," "," "," "," "," "," "," "," "," "," "," "," "," "," "," "," "," "]
[1058," "," "," "," "," "," "," "," "," "," "," "," "," "," "," "," "," "," "," "]
[1059," "," "," "," "," "," "," "," "," "," "," "," "," "," "," "," "," "," "," "]
[1060," "," "," "," "," "," "," "," "," "," "," "," "," "," "," "," "," "," "," "]
[1061," "," "," "," "," "," "," "," "," "," "," "," "," "," "," "," "," "," "," "]
[1062," "," "," "," "," "," "," "," "," "," "," "," "," "," "," "," "," "," "," "]
[1063," "," "," "," "," "," "," "," "," "," "," "," "," "," "," "," "," "," "," "]
[1064," "," "," "," "," "," "," "," "," "," "," "," "," "," "," "," "," "," "," "]
[1065," "," "," "," "," "," "," "," "," "," "," "," "," "," "," "," "," "," "," "]
[1066," "," "," "," "," "," "," "," "," "," "," "," "," "," "," "," "," "," "," "]
[1067," "," "," "," "," "," "," "," "," "," "," "," "," "," "," "," "," "," "," "]
[1068," "," "," "," "," "," "," "," "," "," "," "," "," "," "," "," "," "," "," "]
[1069," "," "," "," "," "," "," "," "," "," "," "," "," "," "," "," "," "," "," "]
[1070," "," "," "," "," "," "," "," "," "," "," "," "," "," "," "," "," "," "," "]
[1071," "," "," "," "," "," "," "," "," "," "," "," "," "," "," "," "," "," "," "]
[1072," "," "," "," "," "," "," "," "," "," "," "," "," "," "," "," "," "," "," "]
[1073," "," "," "," "," "," "," "," "," "," "," "," "," "," "," "," "," "," "," "]
[1074," "," "," "," "," "," "," "," "," "," "," "," "," "," "," "," "," "," "," "]
[1075," "," "," "," "," "," "," "," "," "," "," "," "," "," "," "," "," "," "," "]
[1076," "," "," "," "," "," "," "," "," "," "," "," "," "," "," "," "," "," "," "]
[1077," "," "," "," "," "," "," "," "," "," "," "," "," "," "," "," "," "," "," "]
[1078," "," "," "," "," "," "," "," "," "," "," "," "," "," "," "," "," "," "," "]
[1079," "," "," "," "," "," "," "," "," "," "," "," "," "," "," "," "," "," "," "]
[1080," "," "," "," "," "," "," "," "," "," "," "," "," "," "," "," "," "," "," "]
[1081," "," "," "," "," "," "," "," "," "," "," "," "," "," "," "," "," "," "," "]
[1082," "," "," "," "," "," "," "," "," "," "," "," "," "," "," "," "," "," "," "]
[1083," "," "," "," "," "," "," "," "," "," "," "," "," "," "," "," "," "," "," "]
[1084," "," "," "," "," "," "," "," "," "," "," "," "," "," "," "," "," "," "," "]
[1085," "," "," "," "," "," "," "," "," "," "," "," "," "," "," "," "," "," "," "]
[1086," "," "," "," "," "," "," "," "," "," "," "," "," "," "," "," "," "," "," "]
[1087," "," "," "," "," "," "," "," "," "," "," "," "," "," "," "," "," "," "," "]
[1088," "," "," "," "," "," "," "," "," "," "," "," "," "," "," "," "," "," "," "]
[1089," "," "," "," "," "," "," "," "," "," "," "," "," "," "," "," "," "," "," "]
[1090," "," "," "," "," "," "," "," "," "," "," "," "," "," "," "," "," "," "," "]
[1091," "," "," "," "," "," "," "," "," "," "," "," "," "," "," "," "," "," "," "]
[1092," "," "," "," "," "," "," "," "," "," "," "," "," "," "," "," "," "," "," "]
[1093," "," "," "," "," "," "," "," "," "," "," "," "," "," "," "," "," "," "," "]
[1094," "," "," "," "," "," "," "," "," "," "," "," "," "," "," "," "," "," "," "]
[1095," "," "," "," "," "," "," "," "," "," "," "," "," "," "," "," "," "," "," "]
[1096," "," "," "," "," "," "," "," "," "," "," "," "," "," "," "," "," "," "," "]
[1097," "," "," "," "," "," "," "," "," "," "," "," "," "," "," "," "," "," "," "]
[1098," "," "," "," "," "," "," "," "," "," "," "," "," "," "," "," "," "," "," "]
[1099," "," "," "," "," "," "," "," "," "," "," "," "," "," "," "," "," "," "," "]
[1100," "," "," "," "," "," "," "," "," "," "," "," "," "," "," "," "," "," "," "]
[1101," "," "," "," "," "," "," "," "," "," "," "," "," "," "," "," "," "," "," "]
[1102," "," "," "," "," "," "," "," "," "," "," "," "," "," "," "," "," "," "," "]
[1103," "," "," "," "," "," "," "," "," "," "," "," "," "," "," "," "," "," "," "]
[1104," "," "," "," "," "," "," "," "," "," "," "," "," "," "," "," "," "," "," "]
[1105," "," "," "," "," "," "," "," "," "," "," "," "," "," "," "," "," "," "," "]
[1106," "," "," "," "," "," "," "," "," "," "," "," "," "," "," "," "," "," "," "]
[1107," "," "," "," "," "," "," "," "," "," "," "," "," "," "," "," "," "," "," "]
[1108," "," "," "," "," "," "," "," "," "," "," "," "," "," "," "," "," "," "," "]
[1109," "," "," "," "," "," "," "," "," "," "," "," "," "," "," "," "," "," "," "]
[1110," "," "," "," "," "," "," "," "," "," "," "," "," "," "," "," "," "," "," "]
[1111," "," "," "," "," "," "," "," "," "," "," "," "," "," "," "," "," "," "," "]
[1112," "," "," "," "," "," "," "," "," "," "," "," "," "," "," "," "," "," "," "]
[1113," "," "," "," "," "," "," "," "," "," "," "," "," "," "," "," "," "," "," "]
[1114," "," "," "," "," "," "," "," "," "," "," "," "," "," "," "," "," "," "," "]
[1115," "," "," "," "," "," "," "," "," "," "," "," "," "," "," "," "," "," "," "]
[1116," "," "," "," "," "," "," "," "," "," "," "," "," "," "," "," "," "," "," "]
[1117," "," "," "," "," "," "," "," "," "," "," "," "," "," "," "," "," "," "," "]
[1118," "," "," "," "," "," "," "," "," "," "," "," "," "," "," "," "," "," "," "]
[1119," "," "," "," "," "," "," "," "," "," "," "," "," "," "," "," "," "," "," "]
[1120," "," "," "," "," "," "," "," "," "," "," "," "," "," "," "," "," "," "," "]
[1121," "," "," "," "," "," "," "," "," "," "," "," "," "," "," "," "," "," "," "]
[1122," "," "," "," "," "," "," "," "," "," "," "," "," "," "," "," "," "," "," "]
[1123," "," "," "," "," "," "," "," "," "," "," "," "," "," "," "," "," "," "," "]
[1124," "," "," "," "," "," "," "," "," "," "," "," "," "," "," "," "," "," "," "]
[1125," "," "," "," "," "," "," "," "," "," "," "," "," "," "," "," "," "," "," "]
[1126," "," "," "," "," "," "," "," "," "," "," "," "," "," "," "," "," "," "," "]
[1127," "," "," "," "," "," "," "," "," "," "," "," "," "," "," "," "," "," "," "]
[1128," "," "," "," "," "," "," "," "," "," "," "," "," "," "," "," "," "," "," "]
[1129," "," "," "," "," "," "," "," "," "," "," "," "," "," "," "," "," "," "," "]
[1130," "," "," "," "," "," "," "," "," "," "," "," "," "," "," "," "," "," "," "]
[1131," "," "," "," "," "," "," "," "," "," "," "," "," "," "," "," "," "," "," "]
[1132," "," "," "," "," "," "," "," "," "," "," "," "," "," "," "," "," "," "," "]
[1133," "," "," "," "," "," "," "," "," "," "," "," "," "," "," "," "," "," "," "]
[1134," "," "," "," "," "," "," "," "," "," "," "," "," "," "," "," "," "," "," "]
[1135," "," "," "," "," "," "," "," "," "," "," "," "," "," "," "," "," "," "," "]
[1136," "," "," "," "," "," "," "," "," "," "," "," "," "," "," "," "," "," "," "]
[1137," "," "," "," "," "," "," "," "," "," "," "," "," "," "," "," "," "," "," "]
[1138," "," "," "," "," "," "," "," "," "," "," "," "," "," "," "," "," "," "," "]
[1139," "," "," "," "," "," "," "," "," "," "," "," "," "," "," "," "," "," "," "]
[1140," "," "," "," "," "," "," "," "," "," "," "," "," "," "," "," "," "," "," "]
[1141," "," "," "," "," "," "," "," "," "," "," "," "," "," "," "," "," "," "," "]
[1142," "," "," "," "," "," "," "," "," "," "," "," "," "," "," "," "," "," "," "]
[1143," "," "," "," "," "," "," "," "," "," "," "," "," "," "," "," "," "," "," "]
[1144," "," "," "," "," "," "," "," "," "," "," "," "," "," "," "," "," "," "," "]
[1145," "," "," "," "," "," "," "," "," "," "," "," "," "," "," "," "," "," "," "]
[1146," "," "," "," "," "," "," "," "," "," "," "," "," "," "," "," "," "," "," "]
[1147," "," "," "," "," "," "," "," "," "," "," "," "," "," "," "," "," "," "," "]
[1148," "," "," "," "," "," "," "," "," "," "," "," "," "," "," "," "," "," "," "]
[1149," "," "," "," "," "," "," "," "," "," "," "," "," "," "," "," "," "," "," "]
[1150," "," "," "," "," "," "," "," "," "," "," "," "," "," "," "," "," "," "," "]
[1151," "," "," "," "," "," "," "," "," "," "," "," "," "," "," "," "," "," "," "]
[1152," "," "," "," "," "," "," "," "," "," "," "," "," "," "," "," "," "," "," "]
[1153," "," "," "," "," "," "," "," "," "," "," "," "," "," "," "," "," "," "," "]
[1154," "," "," "," "," "," "," "," "," "," "," "," "," "," "," "," "," "," "," "]
[1155," "," "," "," "," "," "," "," "," "," "," "," "," "," "," "," "," "," "," "]
[1156," "," "," "," "," "," "," "," "," "," "," "," "," "," "," "," "," "," "," "]
[1157," "," "," "," "," "," "," "," "," "," "," "," "," "," "," "," "," "," "," "]
[1158," "," "," "," "," "," "," "," "," "," "," "," "," "," "," "," "," "," "," "]
[1159," "," "," "," "," "," "," "," "," "," "," "," "," "," "," "," "," "," "," "]
[1160," "," "," "," "," "," "," "," "," "," "," "," "," "," "," "," "," "," "," "]
[1161," "," "," "," "," "," "," "," "," "," "," "," "," "," "," "," "," "," "," "]
[1162," "," "," "," "," "," "," "," "," "," "," "," "," "," "," "," "," "," "," "]
[1163," "," "," "," "," "," "," "," "," "," "," "," "," "," "," "," "," "," "," "]
[1164," "," "," "," "," "," "," "," "," "," "," "," "," "," "," "," "," "," "," "]
[1165," "," "," "," "," "," "," "," "," "," "," "," "," "," "," "," "," "," "," "]
[1166," "," "," "," "," "," "," "," "," "," "," "," "," "," "," "," "," "," "," "]
[1167," "," "," "," "," "," "," "," "," "," "," "," "," "," "," "," "," "," "," "]
[1168," "," "," "," "," "," "," "," "," "," "," "," "," "," "," "," "," "," "," "]
[1169," "," "," "," "," "," "," "," "," "," "," "," "," "," "," "," "," "," "," "]
[1170," "," "," "," "," "," "," "," "," "," "," "," "," "," "," "," "," "," "," "]
[1171," "," "," "," "," "," "," "," "," "," "," "," "," "," "," "," "," "," "," "]
[1172," "," "," "," "," "," "," "," "," "," "," "," "," "," "," "," "," "," "," "]
[1173," "," "," "," "," "," "," "," "," "," "," "," "," "," "," "," "," "," "," "]
[1174," "," "," "," "," "," "," "," "," "," "," "," "," "," "," "," "," "," "," "]
[1175," "," "," "," "," "," "," "," "," "," "," "," "," "," "," "," "," "," "," "]
[1176," "," "," "," "," "," "," "," "," "," "," "," "," "," "," "," "," "," "," "]
[1177," "," "," "," "," "," "," "," "," "," "," "," "," "," "," "," "," "," "," "]
[1178," "," "," "," "," "," "," "," "," "," "," "," "," "," "," "," "," "," "," "]
[1179," "," "," "," "," "," "," "," "," "," "," "," "," "," "," "," "," "," "," "]
[1180," "," "," "," "," "," "," "," "," "," "," "," "," "," "," "," "," "," "," "]
[1181," "," "," "," "," "," "," "," "," "," "," "," "," "," "," "," "," "," "," "]
[1182," "," "," "," "," "," "," "," "," "," "," "," "," "," "," "," "," "," "," "]
[1183," "," "," "," "," "," "," "," "," "," "," "," "," "," "," "," "," "," "," "]
[1184," "," "," "," "," "," "," "," "," "," "," "," "," "," "," "," "," "," "," "]
[1185," "," "," "," "," "," "," "," "," "," "," "," "," "," "," "," "," "," "," "]
[1186," "," "," "," "," "," "," "," "," "," "," "," "," "," "," "," "," "," "," "]
[1187," "," "," "," "," "," "," "," "," "," "," "," "," "," "," "," "," "," "," "]
[1188," "," "," "," "," "," "," "," "," "," "," "," "," "," "," "," "," "," "," "]
[1189," "," "," "," "," "," "," "," "," "," "," "," "," "," "," "," "," "," "," "]
[1190," "," "," "," "," "," "," "," "," "," "," "," "," "," "," "," "," "," "," "]
[1191," "," "," "," "," "," "," "," "," "," "," "," "," "," "," "," "," "," "," "]
[1192," "," "," "," "," "," "," "," "," "," "," "," "," "," "," "," "," "," "," "]
[1193," "," "," "," "," "," "," "," "," "," "," "," "," "," "," "," "," "," "," "]
[1194," "," "," "," "," "," "," "," "," "," "," "," "," "," "," "," "," "," "," "]
[1195," "," "," "," "," "," "," "," "," "," "," "," "," "," "," "," "," "," "," "]
[1196," "," "," "," "," "," "," "," "," "," "," "," "," "," "," "," "," "," "," "]
[1197," "," "," "," "," "," "," "," "," "," "," "," "," "," "," "," "," "," "," "]
[1198," "," "," "," "," "," "," "," "," "," "," "," "," "," "," "," "," "," "," "]
[1199," "," "," "," "," "," "," "," "," "," "," "," "," "," "," "," "," "," "," "]
[1200," "," "," "," "," "," "," "," "," "," "," "," "," "," "," "," "," "," "," "]
[1201," "," "," "," "," "," "," "," "," "," "," "," "," "," "," "," "," "," "," "]
[1202," "," "," "," "," "," "," "," "," "," "," "," "," "," "," "," "," "," "," "]
[1203," "," "," "," "," "," "," "," "," "," "," "," "," "," "," "," "," "," "," "]
[1204," "," "," "," "," "," "," "," "," "," "," "," "," "," "," "," "," "," "," "]
[1205," "," "," "," "," "," "," "," "," "," "," "," "," "," "," "," "," "," "," "]
[1206," "," "," "," "," "," "," "," "," "," "," "," "," "," "," "," "," "," "," "]
[1207," "," "," "," "," "," "," "," "," "," "," "," "," "," "," "," "," "," "," "]
[1208," "," "," "," "," "," "," "," "," "," "," "," "," "," "," "," "," "," "," "]
[1209," "," "," "," "," "," "," "," "," "," "," "," "," "," "," "," "," "," "," "]
[1210," "," "," "," "," "," "," "," "," "," "," "," "," "," "," "," "," "," "," "]
[1211," "," "," "," "," "," "," "," "," "," "," "," "," "," "," "," "," "," "," "]
[1212," "," "," "," "," "," "," "," "," "," "," "," "," "," "," "," "," "," "," "]
[1213," "," "," "," "," "," "," "," "," "," "," "," "," "," "," "," "," "," "," "]
[1214," "," "," "," "," "," "," "," "," "," "," "," "," "," "," "," "," "," "," "]
[1215," "," "," "," "," "," "," "," "," "," "," "," "," "," "," "," "," "," "," "]
[1216," "," "," "," "," "," "," "," "," "," "," "," "," "," "," "," "," "," "," "]
[1217," "," "," "," "," "," "," "," "," "," "," "," "," "," "," "," "," "," "," "]
[1218," "," "," "," "," "," "," "," "," "," "," "," "," "," "," "," "," "," "," "]
[1219," "," "," "," "," "," "," "," "," "," "," "," "," "," "," "," "," "," "," "]
[1220," "," "," "," "," "," "," "," "," "," "," "," "," "," "," "," "," "," "," "]
[1221," "," "," "," "," "," "," "," "," "," "," "," "," "," "," "," "," "," "," "]
[1222," "," "," "," "," "," "," "," "," "," "," "," "," "," "," "," "," "," "," "]
[1223," "," "," "," "," "," "," "," "," "," "," "," "," "," "," "," "," "," "," "]
[1224," "," "," "," "," "," "," "," "," "," "," "," "," "," "," "," "," "," "," "]
[1225," "," "," "," "," "," "," "," "," "," "," "," "," "," "," "," "," "," "," "]
[1226," "," "," "," "," "," "," "," "," "," "," "," "," "," "," "," "," "," "," "]
[1227," "," "," "," "," "," "," "," "," "," "," "," "," "," "," "," "," "," "," "]
[1228," "," "," "," "," "," "," "," "," "," "," "," "," "," "," "," "," "," "," "]
[1229," "," "," "," "," "," "," "," "," "," "," "," "," "," "," "," "," "," "," "]
[1230," "," "," "," "," "," "," "," "," "," "," "," "," "," "," "," "," "," "," "]
[1231," "," "," "," "," "," "," "," "," "," "," "," "," "," "," "," "," "," "," "]
[1232," "," "," "," "," "," "," "," "," "," "," "," "," "," "," "," "," "," "," "]
[1233," "," "," "," "," "," "," "," "," "," "," "," "," "," "," "," "," "," "," "]
[1234," "," "," "," "," "," "," "," "," "," "," "," "," "," "," "," "," "," "," "]
[1235," "," "," "," "," "," "," "," "," "," "," "," "," "," "," "," "," "," "," "]
[1236," "," "," "," "," "," "," "," "," "," "," "," "," "," "," "," "," "," "," "]
[1237," "," "," "," "," "," "," "," "," "," "," "," "," "," "," "," "," "," "," "]
[1238," "," "," "," "," "," "," "," "," "," "," "," "," "," "," "," "," "," "," "]
[1239," "," "," "," "," "," "," "," "," "," "," "," "," "," "," "," "," "," "," "]
[1240," "," "," "," "," "," "," "," "," "," "," "," "," "," "," "," "," "," "," "]
[1241," "," "," "," "," "," "," "," "," "," "," "," "," "," "," "," "," "," "," "]
[1242," "," "," "," "," "," "," "," "," "," "," "," "," "," "," "," "," "," "," "]

{"sheet":"RECIBO","index":1,"n_rows":55,"n_cols":15,"rows_kept":55,"cut":false,"hidden":false,"merged":[[4,8,4,11],[6,2,6,4],[11,8,11,10],[7,2,7,4],[8,2,8,4],[9,2,9,4],[10,2,10,4],[30,2,30,11],[27,2,27,11],[1,10,2,10],[1,2,2,9],[6,8,6,9],[7,8,7,9],[8,8,8,9],[9,8,9,9],[1,11,2,11],[4,2,4,6],[23,4,23,6],[19,4,19,8],[19,10,19,11],[15,6,15,11],[23,9,23,11],[33,2,35,11],[21,9,21,11],[25,9,25,11],[31,4,31,11],[29,2,29,11],[52,8,52,11],[41,4,41,11],[45,4,45,6],[47,4,47,6],[51,2,51,4],[49,4,49,6],[49,9,49,11],[43,10,43,11],[45,9,45,11],[47,9,47,11],[51,6,51,7],[11,2,11,5],[10,8,10,9],[38,2,38,11],[39,6,39,11],[32,2,32,11],[17,6,17,11],[25,4,25,6],[28,2,28,11],[21,4,21,6]]}
[]
[" ",null,"RECIBO",null,null,null,null,null,null,null,"Nº","002"]
[" "]
[]
[" ",null,"GANHOS",null,null,null,null,null,"DESCONTOS"]
[]
[null,null,"mensalidade",null,null,"R$",250,null,"INSS",null,"R$",100]
[null,null,null,null,null,"R$",null,null,"IRRF",null,"R$"]
[null,null,null,null,null,"R$"," ",null,null,null,"R$"," "]
[null,null,null,null,null,"R$"," ",null,null,null,"R$"," "]
[null,null,null,null,null,"R$"," ",null,"TOTAL DESCONTO",null,"R$",{"$f":"SUM(L7:L10)","v":100}]
[null,null,"TOTAL BRUTO",null,null,null,{"$f":"SUM(G7:G11)","v":250},null,"LIQUIDO",null,null,{"$f":"G12-L11","v":150}]
[]
[]
[]
[null,null,null,null,null,null,"          DADOS DO CADASTRO",null,null,null,null,null,null,null,2]
[]
[null,null,"RECEBI (EMOS) DE",null,null,null,{"$f":"VLOOKUP($O$16,'CADASTRO- FORNEC - CLIENTE'!$A$3:$O$1360,2)","v":"TILDA & CIA LTDA. - ME"}]
[]
[null,null,"ENDEREÇO ",null,{"$f":"VLOOKUP($O$16,'CADASTRO- FORNEC - CLIENTE'!$A$3:$O$1360,3)","v":"AVENIDA BRASIL"},null,null,null,null,{"$f":"VLOOKUP($O$16,'CADASTRO- FORNEC - CLIENTE'!$A$3:$O$1360,4)","v":10},{"$f":"VLOOKUP($O$16,'CADASTRO- FORNEC - CLIENTE'!$A$3:$O$1360,5)","v":"SALA 2"}]
[]
[null,null,"BAIRRO",null,{"$f":"VLOOKUP($O$16,'CADASTRO- FORNEC - CLIENTE'!$A$3:$O$1360,6)","v":"VILA SÃO JORGE"},null,null,null,"CIDADE",{"$f":"VLOOKUP($O$16,'CADASTRO- FORNEC - CLIENTE'!$A$3:$O$1360,7)","v":"PRESIDENTE PRUDENTE"}]
[]
[null,null,"CEP",null,{"$f":"VLOOKUP($O$16,'CADASTRO- FORNEC - CLIENTE'!$A$3:$O$1360,9)","v":"19.013-000"},null,null,null,"FONE",{"$f":"VLOOKUP($O$16,'CADASTRO- FORNEC - CLIENTE'!$A$3:$O$1360,10)","v":"018 3223-0102"}]
[]
[null,null,"CPF/CNPJ N°",null,{"$f":"VLOOKUP($O$16,'CADASTRO- FORNEC - CLIENTE'!$A$3:$O$1360,11)","v":"02.494.287/0001-89"},null,null,null,"RG/ I.EST. N°",{"$f":"VLOOKUP($O$16,'CADASTRO- FORNEC - CLIENTE'!$A$3:$O$1360,12)","v":"11.444.559-8"}]
[]
[null,null,"A IMPORTÂNCIA DE      "]
[]
[]
[null,null,"\n"]
[]
[null,null,"REFERENTE A"]
[null,null,"Pagamento de mensalidade da formatura parcela 01/2012",null,null,null,null,null,null,null,null,null,0]
[]
[]
[]
[]
[]
[null,null,null,null,null,null,"           DADOS DO CADASTRO ",null,null,null,null,null,null,null,3]
[]
[null,null,"EMITENTE",null,{"$f":"VLOOKUP(O$40,'CADASTRO- FORNEC - CLIENTE'!$A$3:$S$4500,2)","v":"LUIZ CARLOS DOS SANTOS"}]
[]
[null,null,"ENDEREÇO ",null,{"$f":"VLOOKUP($O$40,'CADASTRO- FORNEC - CLIENTE'!$A$3:$O$1360,3)","v":"Rua Pacaembu"},null,null,null,null,{"$f":"VLOOKUP($O$40,'CADASTRO- FORNEC - CLIENTE'!$A$3:$O$1360,4)","v":45},{"$f":"VLOOKUP($O$40,'CADASTRO- FORNEC - CLIENTE'!$A$3:$O$1360,5)","v":"apto 10"}]
[]
[null,null,"BAIRRO",null,{"$f":"VLOOKUP($O$40,'CADASTRO- FORNEC - CLIENTE'!$A$3:$S$4500,6)","v":"Estádio"},null,null,null,"CIDADE",{"$f":"VLOOKUP($O$40,'CADASTRO- FORNEC - CLIENTE'!$A$3:$S$4500,7)","v":"Cambé"}]
[]
[null,null,"CEP",null,{"$f":"VLOOKUP($O$40,'CADASTRO- FORNEC - CLIENTE'!$A$3:$S$4500,9)","v":"18.800-000"},null,null,null,"FONE",{"$f":"VLOOKUP($O$40,'CADASTRO- FORNEC - CLIENTE'!$A$3:$S$4500,10)","v":"043 3390-1515"}]
[]
[null,null,"CNPJ",null,{"$f":"VLOOKUP($O$40,'CADASTRO- FORNEC - CLIENTE'!$A$3:$S$4500,11)","v":"95.889.889-97"},null,null,null,"I.ESTADUAL",{"$f":"VLOOKUP($O$40,'CADASTRO- FORNEC - CLIENTE'!$A$3:$S$4500,12)","v":"15.555.456-9"}]
[]
[null,null,{"$f":"J46","v":"Cambé"},null,null,null,"2014-03-18"]
[null,null,null,null,null,null,null,null,{"$f":"E42","v":"LUIZ CARLOS DOS SANTOS"}]
[null,null,"RECIBO V1 - MOD I -  (28-05-2014) (angelo.tonon@ig.com.br)"]
[null,"OBS:-"]

{"sheet":"C.INTERNA","index":2,"n_rows":48,"n_cols":7,"rows_kept":48,"cut":false,"hidden":true,"merged":[[46,5,46,8],[35,3,35,8],[37,3,37,8],[39,3,39,4],[41,3,41,4],[43,3,43,4],[43,6,43,8],[45,2,45,3],[33,4,33,8],[39,6,39,8],[41,6,41,8],[23,2,25,8],[18,2,20,8],[22,2,22,8],[32,2,32,8],[21,3,21,8],[27,2,27,3],[28,5,28,8],[1,2,2,8],[5,4,5,8],[11,3,11,4],[13,3,13,4],[7,4,7,8],[17,2,17,8],[15,3,15,4],[11,6,11,8],[13,6,13,8],[15,6,15,8]]}
[]
[" ",null,"COMUNICAÇÃO INTERNA"]
[" "]
[]
[]
[null,null,null,13]
[]
[null,null,"DE:-",null,{"$f":"VLOOKUP($D$6,'CADASTRO- FORNEC - CLIENTE'!A4:O1360,2)","v":" "}]
[]
[null,null,"ENDEREÇO ",{"$f":"VLOOKUP($D$6,'CADASTRO- FORNEC - CLIENTE'!$A$4:$O$1360,3)","v":" "}]
[]
[null,null,"BAIRRO",{"$f":"VLOOKUP($D$6,'CADASTRO- FORNEC - CLIENTE'!$A$4:$O$1360,5)","v":" "},null,"CIDADE",{"$f":"VLOOKUP($D$6,'CADASTRO- FORNEC - CLIENTE'!$A$4:$O$1360,6)","v":" "}]
[]
[null,null,"CEP",{"$f":"VLOOKUP($D$6,'CADASTRO- FORNEC - CLIENTE'!$A$4:$O$1360,8)","v":" "},null,"FONE",{"$f":"VLOOKUP($D$6,'CADASTRO- FORNEC - CLIENTE'!$A$4:$O$1360,9)","v":" "}]
[]
[null,null,"CPF/CNPJ N°",{"$f":"VLOOKUP($D$6,'CADASTRO- FORNEC - CLIENTE'!$A$4:$O$1360,10)","v":" "},null,"RG/ I.EST. N°",{"$f":"VLOOKUP($D$6,'CADASTRO- FORNEC - CLIENTE'!$A$4:$O$1360,11)","v":" "}]
[]
[null,null,"RECEBIMENTO DE DOCUMENTO (S):-"]
[null,null,"Declaração de atendimentos de 01/07/2005 do Hospital Universitário de Pres.Prudente - Médico Dr. Waldir Rodrigues da Silva"]
[]
[]
[]
[null,null,"ACEITAÇÃO OU RECUSA DO RECEBIMENTO (S) - (MOTIVO)"]
[null,null,"Recusa:- Esta declaração de atendimento não vale como atestado médico. Para que a empresa aceite, você deverá apresentar Atestado Médico com o código identificado da doença (CID) e o referido atestado médico não poderá conter rasuras."]
[]
[]
[]
[null,null,"PRESIDENTE PRUDENTE",null,"2005-07-02"]
[null,null,null,null,null,{"$f":"E8","v":" "}]
[]
[]
[]
[]
[null,null,null,33]
[]
[null,null,"PARA:-",{"$f":"VLOOKUP($D$34,'CADASTRO- FORNEC - CLIENTE'!$A$4:$AE$1691,2)","v":" "}]
[]
[null,null,"ENDEREÇO ",{"$f":"VLOOKUP($D$34,'CADASTRO- FORNEC - CLIENTE'!$A$4:$AE$1691,3)","v":" "}]
[]
[null,null,"BAIRRO",{"$f":"VLOOKUP($D$34,'CADASTRO- FORNEC - CLIENTE'!$A$4:$AE$1691,5)","v":" "},null,"CIDADE",{"$f":"VLOOKUP($D$34,'CADASTRO- FORNEC - CLIENTE'!$A$4:$AE$1691,6)","v":" "}]
[]
[null,null,"CEP",{"$f":"VLOOKUP($D$34,'CADASTRO- FORNEC - CLIENTE'!$A$4:$AE$1691,8)","v":" "},null,"FONE",{"$f":"VLOOKUP($D$34,'CADASTRO- FORNEC - CLIENTE'!$A$4:$AE$1691,9)","v":" "}]
[]
[null,null,"CPF",{"$f":"VLOOKUP($D$34,'CADASTRO- FORNEC - CLIENTE'!$A$4:$AE$1691,10)","v":" "},null,"RG",{"$f":"VLOOKUP($D$34,'CADASTRO- FORNEC - CLIENTE'!$A$4:$AE$1691,11)","v":" "}]
[]
[null,null,"PRESIDENTE PRUDENTE",null,"2005-07-02"]
[null,null,null,null,null,{"$f":"D36","v":" "}]
[null,null,"recibo v1 (angelotonon@bol.com.br)"]

{"sheet":"ENVELOPE ( )","index":3,"n_rows":45,"n_cols":8,"rows_kept":45,"cut":false,"hidden":true,"merged":[[39,7,44,7],[39,6,44,6],[25,3,29,3],[30,5,34,5],[25,2,44,2],[26,4,44,4],[30,3,44,3],[36,5,44,5]]}
[]
[]
[]
[]
[]
[]
[]
[]
[]
[]
[]
[]
[]
[]
[]
[]
[]
[]
[]
[]
[{"$f":"ENVELOPE!A5","v":2}]
[]
[]
[]
[]
[null,null,{"$f":"VLOOKUP($A$21,'CADASTRO- FORNEC - CLIENTE'!$A$2:AR1464,2)","v":"TILDA & CIA LTDA. - ME"},{"$f":"VLOOKUP($A$21,'CADASTRO- FORNEC - CLIENTE'!$A$2:AR1500,5)","v":"SALA 2"}]
[null,null,null,null,{"$f":"VLOOKUP($A$21,'CADASTRO- FORNEC - CLIENTE'!$A$2:AR1465,4)","v":10}]
[]
[]
[]
[null,null,null,{"$f":"VLOOKUP($A$21,'CADASTRO- FORNEC - CLIENTE'!$A$2:AR1498,3)","v":"AVENIDA BRASIL"},null,{"$f":"VLOOKUP($A$21,'CADASTRO- FORNEC - CLIENTE'!$A$2:AT1509,7)","v":"PRESIDENTE PRUDENTE"}]
[]
[]
[]
[]
[null,null,null,null,null,"-"]
[null,null,null,null,null,{"$f":"VLOOKUP($A$21,'CADASTRO- FORNEC - CLIENTE'!$A$2:AR1466,6)","v":"VILA SÃO JORGE"}]
[]
[]
[null,null,null,null,null,null,{"$f":"VLOOKUP($A$21,'CADASTRO- FORNEC - CLIENTE'!$A$2:AR1467,8)","v":"SÃO PAULO"},{"$f":"VLOOKUP($A$21,'CADASTRO- FORNEC - CLIENTE'!$A$2:AS1467,18)","v":" "}]
[]
[]
[]
[]
[null,"A"]

{"sheet":"ENVELOPE","index":4,"n_rows":10,"n_cols":2,"rows_kept":10,"cut":false,"hidden":true,"merged":[[6,1,6,4],[8,1,8,3]]}
[]
[]
[]
[]
[{"$f":"RECIBO!O16","v":2},"A"]
[null,{"$f":"VLOOKUP($A$5,'CADASTRO- FORNEC - CLIENTE'!$A$2:AR1464,2)","v":"TILDA & CIA LTDA. - ME"}]
[null,{"$f":"VLOOKUP($A$5,'CADASTRO- FORNEC - CLIENTE'!$A$2:AR1464,3)","v":"AVENIDA BRASIL"}]
[null,{"$f":"VLOOKUP($A$5,'CADASTRO- FORNEC - CLIENTE'!$A$2:AR1465,4)","v":10}]
[null,{"$f":"VLOOKUP($A$5,'CADASTRO- FORNEC - CLIENTE'!$A$2:AR1466,6)","v":"VILA SÃO JORGE"}]
[null,{"$f":"VLOOKUP($A$5,'CADASTRO- FORNEC - CLIENTE'!$A$2:AR1467,8)","v":"SÃO PAULO"}]